program: Orca
programVersion: 6.1.0
elementType: Ru P O O P C C C C C H H H H H H H H C C H C H C H C C H H C C H C H C C H C H H C C H C C H C H C H C C H C H C H C H C H H C C H C H C H C H C H C C C H C H C H C H Cl Cl
elementType: Ru
charge: 0
multiplicity: 2
keywords: UKS PBE0 def2-TZVPP TightSCF CPCM(chloroform)
formula: C41H37Cl2O2P2Ru
InChI: InChI=1/2C18H15P.C5H7O2.2ClH.Ru/c2*1-4-10-16(11-5-1)19(17-12-6-2-7-13-17)18-14-8-3-9-15-18;1-4(6)3-5(2)7;;;/h2*1-15H;3H,1-2H3;2*1H;/q;;-2;;;+4/p-2/rC41H37Cl2O2P2Ru/c1-34-33-35(2)45-48(42,43,44-34,46(36-21-9-3-10-22-36,37-23-11-4-12-24-37)38-25-13-5-14-26-38)47(39-27-15-6-16-28-39,40-29-17-7-18-30-40)41-31-19-8-20-32-41/h3-33H,1-2H3
85 atoms
Ru 0.241655 2.56245 1.588193
P  -2.112855 2.250222 2.004153
O  -0.381045 3.211658 -0.2642
O  2.155505 3.141072 1.139155
P  1.267815 1.730198 3.592849
C  0.371974 3.666148 -1.175967
C  2.53737 3.65582 0.046656
C  1.743033 3.900249 -1.073654
C  -0.322536 3.961037 -2.470218
C  3.987973 4.027298 0.00818
H  2.23449 4.318888 -1.940112
H  0.32479 4.474873 -3.177025
H  -1.211957 4.56205 -2.277075
H  -0.657033 3.020411 -2.913445
H  4.307945 4.334496 -0.984796
H  4.586486 3.181338 0.348211
H  4.160174 4.848145 0.707865
H  -1.143228 -2.604384 3.58397
C  -0.446667 -1.97105 4.120105
C  0.117386 -2.403552 5.307633
H  -0.136614 -3.377149 5.709227
C  1.018186 -1.58774 5.977647
H  1.470939 -1.920868 6.903684
C  1.348896 -0.348103 5.46166
H  2.063311 0.270631 5.990242
C  0.771361 0.104223 4.274619
C  -0.121025 -0.723741 3.606245
H  -0.55358 -0.405688 2.667784
H  0.996304 5.423846 7.913815
C  1.042869 4.709808 7.100305
C  1.828511 4.973128 5.987213
H  2.394488 5.894624 5.925614
C  1.885202 4.064546 4.94678
H  2.489495 4.284774 4.075751
C  1.173258 2.866988 5.01358
C  0.383065 2.615118 6.127301
H  -0.186852 1.699638 6.196156
C  0.3162 3.533685 7.16435
H  -0.306107 3.3224 8.025465
H  5.267146 -0.007624 1.286819
C  4.907055 0.489967 2.179492
C  3.563463 0.804182 2.289677
H  2.884886 0.552207 1.486234
C  3.07698 1.444759 3.42633
C  3.966107 1.753674 4.451898
H  3.619201 2.245164 5.350808
C  5.312604 1.441271 4.337925
H  5.988141 1.693484 5.14646
C  5.788225 0.810385 3.20114
H  6.840218 0.566907 3.112027
C  -3.234029 3.417535 1.127242
C  -4.584691 3.076555 1.046694
H  -4.93626 2.140467 1.461894
C  -5.493541 3.92147 0.43487
H  -6.537552 3.637451 0.383046
C  -5.066222 5.12214 -0.112077
H  -5.774972 5.782792 -0.596986
C  -3.729078 5.470386 -0.032728
H  -3.385873 6.408651 -0.452227
C  -2.81689 4.626853 0.585301
H  -1.7804 4.915649 0.654353
H  -3.298199 4.48616 3.429579
C  -3.21546 3.67027 4.134941
C  -3.646072 3.853909 5.437783
H  -4.055444 4.812245 5.733717
C  -3.564921 2.817957 6.354059
H  -3.916591 2.958183 7.369047
C  -3.0264 1.603387 5.964083
H  -2.950864 0.787069 6.672702
C  -2.574989 1.424509 4.666658
H  -2.135349 0.475332 4.395254
C  -2.684162 2.447901 3.728336
H  -3.867795 0.024125 3.154891
C  -3.623886 -0.187427 2.123244
C  -2.813549 0.67443 1.393425
C  -2.564461 0.392717 0.050191
H  -1.945948 1.064553 -0.531405
C  -3.10373 -0.733442 -0.543247
H  -2.902842 -0.937539 -1.588018
C  -3.89362 -1.600717 0.197369
H  -4.310675 -2.486892 -0.265751
C  -4.153393 -1.323811 1.52826
H  -4.78148 -1.986803 2.111029
Cl -0.097792 4.668857 2.533418
Cl 0.605769 0.498288 0.539443
elementType: Ru P O C H Cl
totalener: -3431.36431544489551 hartree
nucrepener: 8028.39735400029713 hartree
twoeener: 9285.35262588285877 hartree
cpcmener: -0.02713772296719 hartree
kineticenergy: 3359.93892055964079 hartree
exchangeener: -263.374435114077 hartree
correlationener: -13.200708102002 hartree
xcener: -276.575143216079 hartree
s2: 0.757441
energy: -2766.0385 -2766.0193 -2102.1514 -2102.0766 -522.8600 -522.8480 -280.4198 -280.4165 -278.8801 -278.8428 -278.8203 -278.7620 -278.7334 -278.7309 -278.5736 -278.5380 -278.5172 -278.5046 -278.4928 -278.4762 -278.4610 -278.4500 -278.4461 -278.4430 -278.4424 -278.4368 -278.4228 -278.4191 -278.4148 -278.4041 -278.3933 -278.3905 -278.3824 -278.3780 -278.3516 -278.3457 -278.3286 -278.3177 -278.3113 -278.3066 -278.3019 -278.2884 -278.2749 -278.2566 -277.9617 -277.9438 -277.7035 -257.8632 -257.8465 -196.1223 -196.1024 -196.0533 -196.0375 -196.0028 -195.9879 -180.8418 -180.7709 -130.1122 -130.1055 -130.0522 -130.0391 -130.0343 -129.9831 -84.4064 -52.9790 -52.9188 -52.0907 -29.3646 -29.0343 -24.5476 -24.5009 -24.2825 -24.2595 -24.2020 -24.1670 -22.1419 -22.0510 -22.0232 -21.4520 -21.3577 -21.2827 -21.2087 -21.2050 -21.1422 -21.0964 -21.0769 -21.0426 -21.0375 -20.9940 -20.9666 -20.9380 -19.6830 -18.6928 -18.6347 -17.3801 -17.2802 -17.2721 -17.1713 -17.1324 -17.0383 -16.9604 -16.9325 -16.8747 -16.8324 -16.5022 -16.0347 -15.9448 -15.2200 -14.7708 -14.7550 -14.7117 -14.6739 -14.3284 -14.1930 -14.1143 -13.6019 -13.1446 -13.1008 -13.0388 -13.0060 -12.9548 -12.8688 -12.8427 -12.7930 -12.7371 -12.7028 -12.6653 -12.5532 -12.5387 -12.2858 -12.1526 -12.1042 -12.0329 -11.9820 -11.9324 -11.8917 -11.8527 -11.8348 -11.7261 -11.5992 -11.5109 -11.4050 -11.2433 -11.0946 -10.9710 -10.8585 -10.8196 -10.7835 -10.7313 -10.6372 -10.5874 -10.5623 -10.4944 -10.4515 -10.4096 -9.9199 -9.9104 -9.8234 -9.8072 -9.7869 -9.7401 -9.6299 -9.5763 -9.5116 -9.3878 -9.3477 -9.2604 -9.0859 -9.0514 -8.7255 -8.6383 -8.3936 -8.1290 -7.8812 -7.8033 -7.7077 -7.5928 -7.5264 -7.4799 -7.4169 -7.3690 -7.3388 -7.2813 -7.1719 -7.1440 -7.0609 -7.0148 -6.8298 -6.5103 -6.3375 -1.3848 -1.3122 -1.1407 -1.0752 -0.9105 -0.8059 -0.6669 -0.5059 -0.4681 -0.4035 -0.3644 electronvolt
energy: -2766.0247 -2766.0061 -2102.1550 -2102.0801 -522.8444 -522.8328 -280.4269 -280.4240 -278.8799 -278.8428 -278.8183 -278.7636 -278.7322 -278.7317 -278.5738 -278.5386 -278.5173 -278.5054 -278.4929 -278.4767 -278.4614 -278.4506 -278.4466 -278.4432 -278.4429 -278.4367 -278.4228 -278.4197 -278.4145 -278.4040 -278.3933 -278.3901 -278.3823 -278.3784 -278.3519 -278.3456 -278.3288 -278.3175 -278.3110 -278.3065 -278.3016 -278.2884 -278.2748 -278.2566 -277.9618 -277.9438 -277.6900 -257.8508 -257.8346 -196.1198 -196.1012 -196.0045 -195.9948 -195.9889 -195.9809 -180.8460 -180.7749 -130.1154 -130.1086 -130.0608 -130.0422 -130.0373 -129.9917 -83.5498 -51.7405 -51.6734 -51.6395 -29.3356 -29.0050 -24.5482 -24.5016 -24.2824 -24.2596 -24.2024 -24.1675 -22.1359 -22.0505 -22.0154 -21.3853 -21.3335 -21.2726 -21.2087 -21.1979 -21.1292 -21.0918 -21.0741 -21.0386 -21.0257 -20.9878 -20.9617 -20.9314 -19.6747 -18.6968 -18.6393 -17.3803 -17.2804 -17.2721 -17.1710 -17.1329 -17.0387 -16.9606 -16.9322 -16.8747 -16.8330 -16.5026 -16.0342 -15.9455 -15.2065 -14.7695 -14.7538 -14.7106 -14.6736 -14.3014 -14.1924 -14.1154 -13.5941 -13.1429 -13.1009 -13.0381 -13.0046 -12.9522 -12.8500 -12.8208 -12.7868 -12.7295 -12.6979 -12.6558 -12.5499 -12.5358 -12.2593 -12.1527 -12.1034 -12.0317 -11.9777 -11.9310 -11.8905 -11.8494 -11.8250 -11.7240 -11.5909 -11.5107 -11.3953 -11.2415 -11.0717 -10.9536 -10.8471 -10.7926 -10.7340 -10.6225 -10.6149 -10.5776 -10.5138 -10.4374 -10.3988 -10.3651 -9.9149 -9.9012 -9.8147 -9.7993 -9.7682 -9.7328 -9.5755 -9.4947 -9.4399 -9.3556 -9.3417 -9.2328 -8.9978 -8.6544 -8.6330 -8.4206 -8.3668 -7.9737 -7.8457 -7.7729 -7.6992 -7.5404 -7.4805 -7.4590 -7.4061 -7.3562 -7.2855 -7.2419 -7.1545 -7.0839 -7.0058 -6.6975 -6.5778 -6.0598 -3.1548 -1.2312 -1.1778 -1.1302 -1.0024 -0.9037 -0.7955 -0.6193 -0.4601 -0.4400 -0.3916 electronvolt
chargesum: -0.0000000
charge: -0.323627 0.735393 -0.389899 -0.373680 0.743043 0.404263 0.401159 -0.394815 -0.273299 -0.275401 0.107170 0.102353 0.110569 0.115861 0.102336 0.112591 0.115880 0.147984 -0.173767 -0.139886 0.149197 -0.163152 0.150437 -0.148792 0.137579 -0.052378 -0.072998 0.133941 0.147527 -0.126033 -0.159446 0.146892 -0.189207 0.138996 0.095145 -0.144836 0.130795 -0.194264 0.142240 0.148793 -0.172210 -0.188376 0.138439 0.057127 -0.168546 0.142309 -0.186646 0.147844 -0.127395 0.146885 -0.131181 -0.108743 0.131472 -0.188112 0.148381 -0.109452 0.147814 -0.188155 0.147774 -0.075370 0.125607 0.137526 -0.133610 -0.185516 0.149044 -0.106335 0.148411 -0.225928 0.148513 -0.154885 0.155209 0.060674 0.141951 -0.141238 -0.032104 -0.077605 0.116584 -0.207390 0.146311 -0.109655 0.148768 -0.176330 0.149380 -0.380070 -0.385833
charge: -0.732988 0.888252 0.150922 0.156182 0.896327 -0.267991 -0.263618 -0.085736 0.030292 0.030882 0.022704 0.022774 0.028218 0.031767 0.022636 0.028461 0.031940 0.026755 -0.013188 -0.005420 0.026905 -0.013228 0.026853 -0.014910 0.030538 -0.204829 -0.030752 0.010154 0.025620 -0.009634 -0.017513 0.025903 -0.031814 0.030162 -0.215198 -0.018228 0.024767 -0.016229 0.024963 0.025859 -0.018146 -0.018928 0.001922 -0.192976 -0.022934 0.024749 -0.018910 0.025127 -0.012091 0.025137 -0.196222 -0.014573 0.029933 -0.017967 0.025528 -0.008780 0.025795 -0.017615 0.025644 -0.023410 0.004714 0.029096 -0.016157 -0.011537 0.027312 -0.007899 0.026539 -0.014842 0.027404 -0.025717 0.023399 -0.202226 0.023698 -0.024923 -0.211911 -0.027088 0.025755 -0.013073 0.026910 -0.008368 0.026166 -0.018076 0.025856 0.013533 0.001595
qa: -0.3236 0.7354 -0.3899 -0.3737 0.7430 0.4043 0.4012 -0.3948 -0.2733 -0.2754 0.1072 0.1024 0.1106 0.1159 0.1023 0.1126 0.1159 0.1480 -0.1738 -0.1399 0.1492 -0.1632 0.1504 -0.1488 0.1376 -0.0524 -0.0730 0.1339 0.1475 -0.1260 -0.1594 0.1469 -0.1892 0.1390 0.0951 -0.1448 0.1308 -0.1943 0.1422 0.1488 -0.1722 -0.1884 0.1384 0.0571 -0.1685 0.1423 -0.1866 0.1478 -0.1274 0.1469 -0.1312 -0.1087 0.1315 -0.1881 0.1484 -0.1095 0.1478 -0.1882 0.1478 -0.0754 0.1256 0.1375 -0.1336 -0.1855 0.1490 -0.1063 0.1484 -0.2259 0.1485 -0.1549 0.1552 0.0607 0.1420 -0.1412 -0.0321 -0.0776 0.1166 -0.2074 0.1463 -0.1097 0.1488 -0.1763 0.1494 -0.3801 -0.3858
va: 5.9710 3.8063 2.1175 2.1380 3.9065 3.7917 3.7988 3.9102 3.9597 3.9589 1.0141 1.0136 1.0082 1.0028 1.0142 1.0070 1.0029 0.9979 4.0333 3.9829 0.9934 3.9910 0.9930 3.9146 1.0034 3.8052 3.8321 0.9902 0.9920 3.9726 3.9835 0.9932 3.9281 1.0059 3.5704 3.9208 1.0090 4.0025 0.9981 0.9935 3.9826 3.9294 1.0334 3.8360 3.9208 1.0036 4.0056 0.9935 3.9723 0.9925 4.0198 3.8904 1.0059 3.9863 0.9947 3.9547 0.9923 4.0221 0.9946 3.8227 1.0189 1.0110 3.9079 4.0020 0.9934 3.9493 0.9928 4.0278 0.9970 3.8291 0.9953 3.5704 1.0134 3.8437 3.7910 3.8974 1.0153 4.0407 0.9947 3.9470 0.9918 3.9888 0.9934 1.0933 1.0888
energyev: 0.384995 0.765812 2.353294 2.381756 2.534920 2.771469 2.818371 2.924097 2.974869 3.055664 3.070317 3.143871 3.195096 3.261467 3.291603 3.342683 3.421151 3.446754 3.484003 3.496906 3.559569 3.580650 3.598226 3.672404 3.680338 3.745980 3.784809 3.792663 3.842048 3.891826 3.913333 3.924820 3.935800 3.943830 3.974258 3.995113 4.017537 4.078807 4.102087 4.120874 4.143449 4.172615 4.314810 4.329298 4.375124 4.396405 4.399072 4.416921 4.423825 4.453938 electronvolt
energy: 3105.2 6176.7 18980.6 19210.2 20445.5 22353.4 22731.7 23584.4 23993.9 24645.6 24763.8 25357.0 25770.2 26305.5 26548.6 26960.6 27593.4 27799.9 28100.4 28204.4 28709.9 28879.9 29021.7 29619.9 29683.9 30213.4 30526.5 30589.9 30988.2 31389.7 31563.2 31655.8 31744.4 31809.1 32054.6 32222.8 32403.6 32897.8 33085.6 33237.1 33419.2 33654.4 34801.3 34918.1 35287.8 35459.4 35480.9 35624.9 35680.6 35923.4 cm-1
energy: -3431.350167142710 hartree
dipole: -34.938078152 34.225578385 -0.712499767 -28.666930764 28.213388850 -0.453541914 63.192435957 -62.017750463 1.174685494
dipolemethod: SCF
magnitude: 1.446804132 au
magnitude: 3.677483848 debye
