program: Orca
programVersion: 6.1.0
elementType: Ru Br N O O N Br C C C C C H H H H H H H C C C H H H C H H H
elementType: Ru
charge: 0
multiplicity: 2
keywords: UKS PBE0 def2-TZVPP TightSCF CPCM(chloroform)
formula: C9H13Br2N2O2Ru
InChI: InChI=1/C5H7O2.2C2H3N.2BrH.Ru/c1-4(6)3-5(2)7;2*1-2-3;;;/h3H,1-2H3;2*1H3;2*1H;/q-2;;;;;+4/p-2/rC9H13Br2N2O2Ru/c1-5-12-16(10,11,13-6-2)14-8(3)7-9(4)15-16/h7H,1-4H3
29 atoms
Ru 0.13671 -0.150555 -0.039741
Br 0.189355 -0.175795 -2.528203
N  -0.042534 -2.149887 -0.057393
O  0.288756 1.83569 -0.022358
O  -1.855144 -0.095751 -0.048493
N  2.143532 -0.178895 -0.031155
Br 0.165409 -0.217585 2.448111
C  -0.699275 2.636768 -0.019206
C  -2.549427 0.969869 -0.041978
C  -2.046936 2.272454 -0.028079
C  -0.326731 4.086072 -0.004591
C  -4.029629 0.74971 -0.05045
H  -2.769712 3.075455 -0.02398
H  -1.200938 4.733098 -0.001789
H  0.287029 4.308675 -0.880046
H  0.280666 4.292517 0.879208
H  -4.302764 0.172761 -0.936534
H  -4.582313 1.68639 -0.044567
H  -4.310448 0.15724 0.822899
C  -0.194727 -3.284552 -0.067925
C  3.287852 -0.143664 -0.0264
C  4.728171 -0.095976 -0.021752
H  5.125446 -1.01538 0.40965
H  5.063404 0.755869 0.5709
H  5.092033 0.010249 -1.044447
C  -0.386142 -4.712809 -0.082776
H  0.282766 -5.164272 -0.816303
H  -1.419325 -4.940948 -0.346908
H  -0.167766 -5.120651 0.904929
elementType: Ru Br N O C H
totalener: -5853.05009773130223 hartree
nucrepener: 2220.41908837270239 hartree
electener: -8073.43437870651360 hartree
twoeener: 4520.10607462124790 hartree
cpcmener: -0.03479409120660 hartree
kineticenergy: 5782.86145488430520 hartree
exchangeener: -201.523908340604 hartree
correlationener: -7.334499433521 hartree
xcener: -208.858407774125 hartree
s2: 0.757663
energy: -13148.8803 -13148.8798 -1703.7495 -1703.7492 -1534.2784 -1534.2780 -1534.2533 -1534.2529 -1534.2454 -1534.2451 -523.1950 -523.1936 -392.7153 -392.7146 -280.5786 -280.5780 -280.4014 -280.3998 -279.4298 -279.4287 -278.0424 -278.0416 -277.9045 -237.5695 -237.5692 -177.8880 -177.8876 -177.7828 -177.7824 -177.7400 -177.7397 -84.7484 -71.3954 -71.3949 -71.3720 -71.3716 -71.3411 -71.3407 -71.2468 -71.2464 -71.2438 -71.2434 -53.3008 -53.2489 -52.4897 -29.6000 -29.2724 -26.7482 -26.7013 -22.2176 -22.0010 -21.9956 -21.0763 -20.1854 -19.9895 -19.8007 -16.6688 -15.8973 -15.2287 -14.8309 -14.5154 -13.8116 -13.4638 -13.4464 -13.1986 -13.1831 -13.1772 -13.1080 -12.9451 -12.4009 -12.1780 -11.5936 -11.3072 -11.1962 -11.0730 -10.8717 -10.7826 -10.7306 -10.3297 -10.3198 -10.0587 -9.3090 -8.7282 -8.4739 -8.0761 -8.0046 -7.6563 -7.5345 -7.1234 -6.9012 -6.5981 -6.4347 -1.5286 -1.2874 -0.0868 0.2388 0.3464 0.3741 0.4953 0.6206 1.0269 1.2398 1.7440 electronvolt
energy: -13148.8761 -13148.8755 -1703.7471 -1703.7467 -1534.2777 -1534.2773 -1534.2438 -1534.2435 -1534.2423 -1534.2419 -523.1697 -523.1682 -392.7245 -392.7237 -280.5893 -280.5887 -280.3966 -280.3950 -279.4299 -279.4289 -278.0425 -278.0417 -277.8853 -237.5628 -237.5624 -177.8878 -177.8874 -177.7608 -177.7605 -177.7372 -177.7369 -83.9289 -71.3912 -71.3908 -71.3620 -71.3616 -71.3413 -71.3409 -71.2352 -71.2348 -71.2336 -71.2332 -52.1594 -52.1093 -51.9685 -29.5530 -29.2239 -26.7473 -26.7008 -22.1948 -21.9998 -21.9950 -21.0792 -20.1174 -19.9227 -19.7887 -16.6678 -15.8728 -15.1875 -14.8229 -14.5009 -13.7961 -13.4495 -13.4413 -13.1772 -13.1683 -13.1660 -13.1093 -12.8460 -12.3467 -12.1776 -11.5670 -11.3058 -11.0045 -10.8727 -10.8589 -10.7728 -10.6783 -10.3270 -10.2455 -9.9131 -9.2603 -8.4542 -8.0054 -7.9349 -7.7802 -7.5160 -7.4354 -6.8427 -6.5671 -6.1832 -3.4011 -1.2753 -1.2584 0.2664 0.3459 0.3989 0.4109 0.5291 0.6261 1.0288 1.2467 electronvolt
chargesum: -0.0000000
charge: -0.065215 -0.416260 0.237851 -0.350406 -0.349907 0.238578 -0.416128 0.408636 0.407969 -0.385412 -0.272548 -0.272191 0.109382 0.101874 0.117773 0.117700 0.117530 0.101857 0.117593 -0.097407 -0.097917 -0.117521 0.145300 0.147737 0.147633 -0.117346 0.146234 0.147514 0.147096
charge: -0.491350 -0.093836 0.176507 0.159141 0.159297 0.176576 -0.093593 -0.252517 -0.252534 -0.077955 0.031924 0.031960 0.025511 0.024467 0.032395 0.032374 0.032373 0.024454 0.032389 -0.046351 -0.046415 0.040745 0.054853 0.055848 0.056124 0.040737 0.055318 0.055681 0.055876
qa: -0.0652 -0.4163 0.2379 -0.3504 -0.3499 0.2386 -0.4161 0.4086 0.4080 -0.3854 -0.2725 -0.2722 0.1094 0.1019 0.1178 0.1177 0.1175 0.1019 0.1176 -0.0974 -0.0979 -0.1175 0.1453 0.1477 0.1476 -0.1173 0.1462 0.1475 0.1471
va: 5.6601 0.9965 3.4195 2.1601 2.1598 3.4192 0.9968 3.7417 3.7429 3.9442 3.9617 3.9616 1.0127 1.0130 1.0049 1.0050 1.0051 1.0130 1.0051 3.8282 3.8287 3.8751 0.9964 0.9960 0.9963 3.8747 0.9963 0.9960 0.9964
energyev: 0.372501 0.497145 2.238639 2.240504 2.597803 2.741481 2.789545 2.801985 2.929154 3.031821 3.043437 3.148328 3.362258 3.416992 3.418724 3.481501 3.522723 3.726635 3.912006 4.040627 4.115749 4.151594 4.230613 4.234703 4.329254 4.383755 4.390384 4.460978 4.490381 4.504573 4.530953 4.726672 4.779467 4.828303 4.847545 4.940025 5.000477 5.044975 5.086948 5.182206 5.247447 5.289414 5.290221 5.316793 5.346455 5.358464 5.359846 5.363209 5.395589 5.404332 electronvolt
energy: 3004.4 4009.7 18055.8 18070.9 20952.7 22111.5 22499.2 22599.5 23625.2 24453.3 24547.0 25393.0 27118.4 27559.9 27573.9 28080.2 28412.7 30057.3 31552.5 32589.9 33195.8 33484.9 34122.2 34155.2 34917.8 35357.4 35410.8 35980.2 36217.4 36331.8 36544.6 38123.2 38549.0 38942.9 39098.1 39844.0 40331.6 40690.5 41029.0 41797.3 42323.5 42662.0 42668.5 42882.8 43122.1 43218.9 43230.1 43257.2 43518.4 43588.9 cm-1
energy: -5853.036408584693 hartree
dipole: -11.883301415 13.466538612 1.583237198 13.222664206 -14.973591059 -1.750926853 0.038472944 -0.048589311 -0.010116367
dipolemethod: SCF
magnitude: 2.360611617 au
magnitude: 6.000197888 debye
