program: Orca
programVersion: 6.1.0
elementType: Ru N C C H H H Cl N C C H H H Cl O O C C C C C H H H H H H H
elementType: Ru
keywords: UKS PBE0 def2-TZVPP TightSCF CPCM(chloroform) NormalPrint
formula: C9H13Cl2N2O2Ru
InChI: InChI=1/C5H7O2.2C2H3N.2ClH.Ru/c1-4(6)3-5(2)7;2*1-2-3;;;/h3H,1-2H3;2*1H3;2*1H;/q-2;;;;;+4/p-2/rC9H13Cl2N2O2Ru/c1-5-12-16(10,11,13-6-2)14-8(3)7-9(4)15-16/h7H,1-4H3
29 atoms
Ru -1.42991 0.000385 -0.053562
N  -1.346832 -0.000936 -2.04802
C  -1.333313 -0.001629 -3.192917
C  -1.313135 -0.003246 -4.634383
H  -2.056427 0.699076 -5.01335
H  -1.541788 -1.003926 -5.002806
H  -0.32433 0.29353 -4.985511
Cl -3.018588 -1.69503 -0.115851
N  -1.502416 0.002406 1.94155
C  -1.576193 0.004122 3.084098
C  -1.666836 0.006235 4.522909
H  -2.693984 -0.19791 4.827553
H  -1.364183 0.981041 4.906831
H  -1.010189 -0.762708 4.930994
Cl -3.016752 1.697282 -0.119143
O  0.014111 -1.410413 0.005768
O  0.015628 1.409477 0.003623
C  1.270944 -1.23775 0.049233
C  1.272267 1.235524 0.047513
C  1.918543 -0.001428 0.069601
C  2.074797 -2.500089 0.079989
C  2.077239 2.497139 0.076808
H  2.998168 -0.00191 0.107426
H  3.14321 -2.300837 0.117275
H  1.845577 -3.095177 -0.8063
H  1.783832 -3.09211 0.950087
H  1.848539 3.091442 -0.810121
H  3.145497 2.297216 0.114471
H  1.786525 3.090225 0.946235
elementType: Ru N C H Cl O
totalener: -1625.45018316140909 hartree
nucrepener: 1560.06888001930292 hartree
electener: -3185.47802464279584 hartree
oneelecener: -5376.13617556980626 hartree
twoeener: 2190.65815092701041 hartree
cpcmener: -0.04107825731358 hartree
kineticenergy: 1560.50143970744330 hartree
exchangeener: -108.788205390677 hartree
correlationener: -5.229076663132 hartree
xcener: -114.017282053809 hartree
s2: 0.754001
energy: -2765.8759 -2765.8754 -523.2156 -523.2155 -392.6836 -392.6818 -280.6932 -280.6930 -280.3603 -280.3602 -279.4040 -279.4035 -278.1315 -278.1313 -277.8609 -257.7017 -257.7013 -195.9590 -195.9585 -195.8887 -195.8882 -195.8432 -195.8428 -84.9224 -53.5040 -53.4441 -52.5915 -29.6877 -29.3228 -26.7233 -26.6487 -22.2588 -21.9774 -21.9573 -21.2191 -21.1557 -21.0326 -19.8850 -16.7262 -15.6833 -15.4535 -14.7911 -14.6462 -13.9303 -13.8680 -13.2954 -13.1911 -13.1190 -13.1184 -13.0527 -12.5722 -12.4499 -12.2879 -11.7098 -11.4242 -11.2952 -11.2857 -11.0406 -10.5850 -10.5817 -10.3757 -10.3701 -10.1399 -9.8509 -9.2765 -8.7333 -8.3931 -8.2924 -8.0440 -7.7176 -7.4022 -6.9946 -6.7238 -6.3607 -1.3487 -1.1107 -0.4427 0.0949 0.0960 0.7020 0.7184 0.7301 0.8464 1.5308 1.5996 electronvolt
energy: -2765.8645 -2765.8640 -523.1961 -523.1960 -392.6860 -392.6842 -280.6927 -280.6925 -280.3654 -280.3653 -279.4037 -279.4032 -278.1318 -278.1317 -277.8591 -257.6915 -257.6911 -195.9617 -195.9612 -195.8430 -195.8426 -195.8372 -195.8368 -84.0418 -52.3223 -52.1134 -52.0979 -29.6455 -29.2801 -26.7279 -26.6543 -22.2504 -21.9792 -21.9596 -21.1524 -21.1446 -20.9624 -19.8807 -16.7123 -15.6627 -15.3870 -14.8017 -14.6193 -13.9112 -13.7924 -13.2884 -13.1893 -13.1231 -13.1225 -13.0591 -12.5841 -12.4401 -12.2271 -11.6267 -11.4093 -11.2461 -11.2314 -11.0155 -10.5751 -10.5742 -10.3664 -10.1335 -9.8029 -9.7708 -8.9212 -8.4183 -8.3047 -8.2025 -7.9656 -7.4715 -7.3273 -6.4381 -6.1382 -3.0588 -1.3431 -0.8842 -0.0612 0.0822 0.1656 0.7085 0.7407 0.7532 0.8466 1.5377 electronvolt
chargesum: -0.0000000
charge: 0.047312 0.238067 -0.101560 -0.111447 0.148112 0.147038 0.144272 -0.431355 0.237716 -0.101296 -0.111871 0.148648 0.145733 0.145195 -0.431287 -0.366286 -0.366270 0.374932 0.374885 -0.384598 -0.268403 -0.268408 0.112964 0.102851 0.118066 0.118036 0.118059 0.102856 0.118036
charge: -0.443337 0.172551 -0.046925 0.040275 0.055921 0.055509 0.054442 -0.098994 0.172594 -0.046852 0.040313 0.056144 0.054991 0.054699 -0.098873 0.155897 0.155952 -0.254159 -0.254186 -0.092655 0.032843 0.032854 0.022426 0.024318 0.032487 0.032486 0.032475 0.024308 0.032497
qa: 0.0473 0.2381 -0.1016 -0.1114 0.1481 0.1470 0.1443 -0.4314 0.2377 -0.1013 -0.1119 0.1486 0.1457 0.1452 -0.4313 -0.3663 -0.3663 0.3749 0.3749 -0.3846 -0.2684 -0.2684 0.1130 0.1029 0.1181 0.1180 0.1181 0.1029 0.1180
va: 5.6976 3.3810 3.8200 3.8733 0.9962 0.9962 0.9967 0.9892 3.3810 3.8194 3.8745 0.9958 0.9964 0.9965 0.9893 2.1389 2.1390 3.7987 3.7987 3.8872 3.9634 3.9634 1.0131 1.0123 1.0048 1.0048 1.0048 1.0123 1.0048
energy: -1625.450183161409 hartree
dipole: 52.058354279 -48.242559502 3.815794778 -0.012883730 0.012772199 -0.000111531 1.934787945 -1.787217954 0.147569992
dipolemethod: SCF
magnitude: 3.818647234 au
magnitude: 9.706229903 debye
