title: ChemShell job
elementType: c
basis: def2-mSVP
elementType: n
elementType: h
elementType: s
elementType: li
method: uhf
method: dft
functional: pbeh-3c
elementType: c n h s li
basis: def2-mSVP def2-mSVP def2-mSVP def2-mSVP def2-mSVP
frequency: -36.77 -0.00 0.0000 0.0000 0.0000 0.0000 0.0000 35.64 47.45 59.11 69.04 78.23 102.10 114.45 149.94 158.97 169.95 175.97 194.25 218.09 221.40 231.98 288.86 308.56 320.24 324.95 339.74 345.16 359.31 377.80 385.95 409.16 437.13 478.19 511.37 536.28 540.40 544.41 557.67 568.98 586.02 616.67 625.48 631.79 652.71 654.77 697.86 711.83 717.32 721.29 771.51 781.74 791.88 797.44 843.29 848.94 866.72 869.56 898.45 911.48 914.61 949.89 1008.18 1024.13 1036.97 1049.68 1090.49 1108.92 1151.42 1164.27 1190.63 1204.31 1216.58 1270.30 1279.47 1295.24 1333.78 1353.54 1365.22 1377.40 1399.96 1409.63 1421.34 1452.32 1484.57 1502.56 1506.14 1531.78 1550.69 1564.48 1595.89 1601.08 1627.11 1650.91 1660.31 1706.07 1715.11 1724.43 3281.59 3286.59 3296.27 3297.61 3301.69 3316.02 3623.50
irintensity: 0.00000 0.00000 0 0 0 0 0 15.69553 15.91726 43.50142 11.11345 88.99758 83.29066 10.99086 37.11780 16.55053 274.94083 229.44742 48.95118 48.21448 5.27546 7.91424 0.43880 16.35334 19.24567 288.61010 96.60248 1.14063 143.32843 110.34537 89.86490 438.13076 8.78969 0.62327 10.60287 74.57541 541.47454 96.76628 282.78239 1355.05906 3122.71940 11.97531 2.01545 0.20901 13.92939 31.17229 21.41902 64.06907 6.65599 54.10959 11.37995 11.46745 35.53810 127.26245 32.77681 11.27367 12.49950 6.14662 22.12796 97.33902 75.16065 168.89554 157.33497 12.87778 1.56634 14.78977 93.82094 88.67495 96.22606 107.42017 303.85944 351.05851 174.42049 307.75525 219.23850 6.51555 10.59349 170.84222 696.25234 1081.14495 267.47008 30.54509 8.81316 25.06900 961.94686 538.01981 201.75748 210.82599 1421.81435 568.29323 285.07188 282.01187 45.44305 157.55474 539.08498 238.66393 2103.92435 801.27778 106.33103 16.48950 8.31867 41.88029 31.16698 2.72487 271.29299
energy: -2886.732826509 hartree
zeropoint: 0.22483334593999998 hartree
formula: C19H7LiN3S5
InChI: InChI=1/C19H7N3S5.Li/c23-16-8-2-1-7-5-6-20-17-11(7)12(8)15-13-9(19(24)22-18(15)21-17)3-4-10(14(13)16)26-27-25;/h1-6,22H;/q-2;+2/rC19H7LiN3S5/c24-16-8-2-1-7-5-6-22-19-11(7)12(8)15-13-9(3-4-10(14(13)16)27-28-26)18(25)21-17(15)23(19)20-22/h1-6,21H
35 atoms
C  -1.57106293 -2.33568578 -0.39634689
N  -2.66998308 -1.65388605 -0.195134
C  -0.27833739 -1.74957153 -0.46821595
C  -2.57238071 -0.31257859 -0.0498022
C  -0.17599951 -0.37045012 -0.31701408
C  -1.3495149 0.36771507 -0.1049058
N  -3.73346652 0.31891037 0.15006912
C  -1.32656518 1.76205755 0.05105009
C  -3.71202665 1.63679988 0.2939669
C  -2.54915491 2.40150385 0.25398794
C  1.07442988 0.28198471 -0.38838964
C  1.08799794 1.69121674 -0.2253143
C  -0.05576107 2.40693013 -0.01003515
C  0.86312679 -2.5552443 -0.67674032
C  2.14422227 -1.9428305 -0.74101305
C  2.24645722 -0.50208413 -0.6604372
H  -0.00085634 3.47950926 0.11587294
H  -2.60783019 3.47341989 0.38011115
H  -4.66823783 2.11831339 0.45124587
C  3.27350364 -2.78705316 -0.88305461
C  0.69033634 -3.94348642 -0.81778375
N  -1.66948817 -3.68521057 -0.543417
C  -0.63974063 -4.54267161 -0.75271487
C  3.07142259 -4.15723212 -1.06816679
C  1.81604479 -4.72354706 -1.04078274
H  3.90713042 -4.81466587 -1.24809124
H  1.71270775 -5.78913862 -1.19123805
S  4.92070657 -2.14571178 -0.82317436
S  6.05243114 -3.9130487 -0.28244941
H  2.03206759 2.21592153 -0.27121882
S  7.0959212 -4.3807008 -1.86298229
S  3.69844913 0.26731045 -0.96379131
S  -0.94153132 -6.1588988 -0.91073222
H  -2.59825038 -4.08783237 -0.48994571
Li -4.78021855 -1.4700402 0.0741532
energy: -2886.7328265094643
energyOcCorr: -2886.7308337920
s2: 0.00000000
charge: 1.000000
dipole: 514.691916 -520.899780 -6.207864 -794.626478 793.378505 -1.247973 -248.783537 249.213410 0.429873
quadrupole: 9735.091332 -9806.587840 -71.496508 7862.771484 -7984.991490 -122.220006 503.918257 -647.920458 -144.002200 -4132.280929 4135.055995 2.775066 -1537.038494 1536.808197 -0.230297 1579.229353 -1578.654339 0.575014
temp: 298.15 k
press: 1.0 bar
thermalcorrgfe: 0.174218229318 hartree
thermalcorrener: 0.245846484506 hartree
entropy: 0.63906 kJ.mol-1.K-1
thermalcorrenthalpy: 0.24678725761200002 hartree
