title: ChemShell job
elementType: c
basis: def2-TZVPD
elementType: n
elementType: h
elementType: s
elementType: li
method: uhf
method: dft
functional: cam-b3lyp
elementType: c n h s li
basis: def2-TZVPD def2-TZVPD def2-TZVPD def2-TZVPD def2-TZVPD
energy: -2891.270004953 hartree
formula: C19H7LiN3S5
InChI: InChI=1/C19H7N3S5.Li/c23-16-8-2-1-7-5-6-20-17-11(7)12(8)15-13-9(19(24)22-18(15)21-17)3-4-10(14(13)16)26-27-25;/h1-6,22H;/q-2;+2/rC19H7LiN3S5/c24-16-8-2-1-7-5-6-22-19-11(7)12(8)15-13-9(3-4-10(14(13)16)27-28-26)18(25)21-17(15)23(19)20-22/h1-6,21H
35 atoms
C  -1.51083883 -2.34281273 -0.42771595
N  -2.6404177 -1.69897381 -0.20568198
C  -0.24547397 -1.7394018 -0.49927994
C  -2.57268571 -0.35759396 -0.03379399
C  -0.16317398 -0.35138496 -0.32887096
C  -1.35734185 0.35555296 -0.08857699
N  -3.74221658 0.24612097 0.18898298
C  -1.36535985 1.7498958 0.09076299
C  -3.74177058 1.57063182 0.36270396
C  -2.6094917 2.35742673 0.32614696
C  1.06059888 0.32388896 -0.42069895
C  1.03464488 1.73600481 -0.23925297
C  -0.11439399 2.42513272 0.014097
C  0.9150729 -2.50790472 -0.71516792
C  2.18835475 -1.86270079 -0.76549591
C  2.25687674 -0.40950295 -0.71745892
H  -0.08294099 3.4977686 0.15522898
H  -2.6884917 3.42572261 0.47397195
H  -4.70896747 2.02443077 0.54036894
C  3.33804762 -2.6966477 -0.8585909
C  0.77581291 -3.90566256 -0.8677359
N  -1.57763782 -3.69443458 -0.59692493
C  -0.52918694 -4.52600549 -0.81282391
C  3.16830264 -4.07285554 -1.06282088
C  1.92578478 -4.65906447 -1.07949888
H  4.03253954 -4.69833146 -1.23426486
H  1.83973479 -5.72397935 -1.24962686
S  4.99122744 -2.09117276 -0.67166792
S  6.09319031 -3.81756957 -0.16579298
H  1.97144077 2.27387374 -0.30219097
S  6.65379924 -4.76036246 -1.90528279
S  3.68636858 0.40087096 -1.05942488
S  -0.82336091 -6.1592463 -0.98438089
H  -2.49491572 -4.12071653 -0.54778194
Li -4.69275347 -1.56583582 0.06476399
energy: -2891.2700049532800
energyOcCorr: -2891.2811661650
s2: -0.00000000
charge: -1.000000
dipole: 514.781446 -534.474831 -19.693385 -794.379681 803.946751 9.567071 -248.677841 252.834975 4.157134
quadrupole: 9470.427943 -9736.819391 -266.391448 7946.090525 -8193.333776 -247.243251 531.372060 -694.341382 -162.969323 -4172.970650 4280.581837 107.611187 -1481.910923 1519.502441 37.591518 1624.213978 -1652.575136 -28.361158
