title: ChemShell job
elementType: c
basis: def2-mSVP
elementType: n
elementType: h
elementType: s
elementType: li
method: uhf
method: dft
functional: pbeh-3c
elementType: c n h s li
basis: def2-mSVP def2-mSVP def2-mSVP def2-mSVP def2-mSVP
frequency: -0.00 -0.00 0.0000 0.0000 0.0000 0.0000 29.42 34.00 54.39 74.68 86.00 102.64 125.79 139.04 166.56 167.88 179.38 183.55 190.27 216.91 222.78 239.07 247.56 275.28 290.89 311.41 325.24 331.55 336.84 346.19 372.82 376.93 393.31 394.40 424.88 473.01 482.45 512.08 525.08 537.95 541.71 548.06 555.78 573.51 612.54 618.34 626.16 656.81 663.13 696.04 709.63 714.89 724.79 763.20 778.85 785.80 795.99 842.13 850.15 859.69 884.58 893.02 909.22 910.38 949.39 1000.19 1032.29 1035.63 1045.25 1074.17 1103.67 1151.95 1163.85 1172.89 1194.32 1217.05 1270.62 1275.13 1294.91 1343.51 1350.45 1356.52 1383.55 1391.34 1398.47 1420.77 1443.50 1476.32 1501.64 1505.08 1529.09 1554.46 1566.28 1595.50 1600.47 1632.10 1653.67 1682.15 1703.27 1715.30 1721.18 3277.65 3277.86 3281.72 3296.65 3298.13 3299.19 3626.27
irintensity: 0.00000 0.00000 0 0 0 0 14.06320 11.14444 11.26735 6.73647 3.32538 63.33428 2.80853 43.65821 2.66973 29.38194 32.94715 45.27790 29.71260 3.42199 30.82461 9.89453 46.83839 36.34640 40.99782 46.60728 5.72450 73.27672 223.65200 5.01411 183.06509 16.05808 3.98755 90.45934 3.70183 11.13380 108.90825 44.93697 61.26766 53.26799 57.26067 20.59045 32.62995 6.45907 19.70981 39.45289 2.67017 26.48662 11.35533 7.59107 31.76713 6.31757 52.81627 29.75919 17.98797 47.60262 126.37178 8.94519 11.71691 73.82772 21.83090 41.45374 81.21591 74.68893 63.44407 110.33623 3.69637 0.09750 0.79508 35.99272 12.26568 86.73955 138.99710 336.37663 104.90793 381.02295 372.08951 85.74901 53.19287 218.48321 174.47505 211.60056 351.88610 48.86201 290.23515 65.96401 43.05747 693.93693 82.59188 146.06960 294.77712 374.05131 185.22564 111.85078 161.99613 125.49273 499.74841 8.36262 896.92881 812.28474 1065.07567 1.22266 38.01134 2.16749 11.50057 12.38010 3.03794 199.82347
energy: -2894.382463381 hartree
zeropoint: 0.22708053676 hartree
formula: C19H7Li2N3S5
InChI: InChI=1/C19H7N3S5.2Li/c23-16-8-2-1-7-5-6-20-17-11(7)12(8)15-13-9(19(24)22-18(15)21-17)3-4-10(14(13)16)26-27-25;;/h1-6,22H;;/q-3;+1;+2/rC19H7Li2N3S5/c25-18-9-3-4-10-14-13(9)15-12-8(16(14)27-21-29(10)28-26)2-1-7-5-6-23-19(11(7)12)24(20-23)17(15)22-18/h1-6,22H
36 atoms
C  -1.3367435 -2.53844918 -0.42810776
N  -2.41236759 -1.79523996 -0.51491885
C  -0.01999474 -2.02639989 -0.36684282
C  -2.25131201 -0.44968388 -0.55282923
C  0.15327952 -0.64465471 -0.4025889
C  -0.99011916 0.16653417 -0.50245329
N  -3.38382562 0.25240634 -0.63460471
C  -0.90131866 1.56882921 -0.52629051
C  -3.29531844 1.57875628 -0.67139618
C  -2.09901544 2.27965454 -0.62199075
C  1.43237825 -0.06665998 -0.26368392
C  1.50793361 1.36224592 -0.2997916
C  0.40609937 2.14466201 -0.44646084
C  1.0914725 -2.88901593 -0.32601093
C  2.40520999 -2.33709978 -0.28221905
C  2.54657363 -0.91121321 -0.03013496
H  0.51067274 3.22022018 -0.49866486
H  -2.10823318 3.36034052 -0.65042696
H  -4.23188615 2.11674224 -0.74000814
C  3.46179615 -3.25334544 -0.49365581
C  0.86516117 -4.28662416 -0.34926316
N  -1.49358294 -3.89356454 -0.40107165
C  -0.4994291 -4.81267957 -0.36039236
C  3.22935581 -4.61769948 -0.5201298
C  1.95069052 -5.13865794 -0.3910696
H  4.05278629 -5.29681867 -0.69824095
H  1.80159607 -6.2093014 -0.40322148
S  5.14115323 -2.84853813 -0.90496976
S  4.94622414 -1.28200198 -2.26585554
H  2.48143632 1.82788184 -0.23282857
S  5.68861325 0.30166295 -1.24301228
S  3.88348795 -0.21387116 0.75994748
Li 6.06301303 -1.26149887 0.81482165
S  -0.880732 -6.42224695 -0.33074093
H  -2.44270654 -4.24801497 -0.42365794
Li -4.49940545 -1.48231069 -0.61322655
energy: -2894.3824633814252
energyOcCorr: -2894.3808545213
s2: 0.81274855
charge: 1.000000
dipole: 567.156541 -568.571623 -1.415082 -695.767383 694.208189 -1.559193 -235.577879 236.054374 0.476495
quadrupole: 8436.222592 -8465.054606 -28.832014 6880.146489 -7016.685196 -136.538707 584.542944 -729.330985 -144.788041 -1853.615451 1840.687131 -12.928320 -941.728685 966.897953 25.169268 650.413947 -652.196177 -1.782229
temp: 298.15 k
press: 1.0 bar
thermalcorrgfe: 0.17496475372599998 hartree
thermalcorrener: 0.249918089568 hartree
entropy: 0.66837 kJ.mol-1.K-1
thermalcorrenthalpy: 0.250862671472 hartree
