title: ChemShell job
elementType: c
basis: def2-mSVP
elementType: n
elementType: h
elementType: s
method: uhf
method: dft
functional: pbeh-3c
elementType: c n h s
basis: def2-mSVP def2-mSVP def2-mSVP def2-mSVP
frequency: -0.00 0.0000 0.0000 0.0000 0.0000 0.0000 35.34 54.50 64.43 81.70 144.09 178.19 186.31 197.59 210.78 227.31 283.01 295.60 302.67 313.08 337.57 348.31 358.97 392.95 401.14 403.02 478.52 502.11 508.51 527.48 540.57 541.78 544.68 553.07 573.40 617.53 624.00 634.63 656.35 660.23 689.56 711.37 719.61 734.00 758.10 787.69 788.63 800.10 844.44 847.93 868.91 890.92 906.28 907.79 918.29 944.76 1000.83 1035.68 1037.66 1051.44 1054.06 1101.50 1147.78 1157.71 1174.99 1199.19 1230.35 1276.15 1293.18 1305.10 1334.95 1354.34 1361.89 1392.78 1403.56 1415.88 1427.57 1444.03 1477.43 1506.96 1510.26 1536.60 1557.45 1579.40 1601.33 1616.56 1644.18 1668.52 1686.91 1708.61 1727.30 1744.11 3258.04 3277.41 3283.42 3296.47 3296.57 3297.34 3629.20
irintensity: 0.00000 0 0 0 0 0 0.07978 2.91592 0.37130 1.39110 6.21172 5.73490 1.22619 4.33682 0.62721 2.10290 4.05932 3.43035 7.50095 12.14895 13.53033 0.74164 0.92347 13.33735 25.49769 4.61075 6.39340 12.71855 21.01716 25.43005 9.48040 2.17689 17.95207 6.45475 1.56157 2.46712 7.40034 0.51191 28.85842 5.71704 17.52907 5.57067 7.36084 91.50732 8.52600 23.37191 31.37828 32.62938 12.43313 5.05535 24.79732 17.84112 59.86615 19.78176 25.53100 16.75684 75.77878 0.14261 0.45486 0.37712 3.25588 24.06988 43.42370 40.28851 304.02035 67.59619 174.81648 286.68534 33.80005 15.88895 145.45639 88.23777 92.30901 43.20754 490.27343 44.56996 5.67282 27.60823 173.54848 218.68165 9.08643 640.17558 240.78257 82.18563 49.98093 83.69201 244.89416 422.56075 18.56056 686.81937 209.64796 563.05415 66.70176 0.80833 2.74686 3.96390 8.02228 3.67113 198.55761
energy: -2481.625234500 hartree
zeropoint: 0.22361453058 hartree
formula: C19H7N3S4
InChI: InChI=1/C19H7N3S4/c23-19-9-3-4-10-14-13(9)15-12-8(16(14)25-26-24-10)2-1-7-5-6-20-17(11(7)12)21-18(15)22-19/h1-6,22H
33 atoms
C  -1.48369008 -2.58662912 -0.4719805
N  -2.5588111 -1.89699427 -0.23301586
C  -0.18660169 -2.03964471 -0.68348917
C  -2.45227907 -0.5476889 -0.16609599
C  -0.06257155 -0.66169652 -0.614945
C  -1.21209593 0.10508516 -0.34906444
N  -3.57234129 0.13627408 0.0853295
C  -1.13922845 1.50732267 -0.25536269
C  -3.4897834 1.4529627 0.16685224
C  -2.31573249 2.18963826 0.01165138
C  1.20669345 -0.04551005 -0.79397795
C  1.24625431 1.39449235 -0.71397303
C  0.14135644 2.12696896 -0.45708973
C  0.91939396 -2.86805887 -0.9443142
H  0.21023751 3.20559254 -0.41538385
H  -2.33630215 3.26711488 0.09782852
H  -4.41668917 1.97593221 0.37177803
C  0.71810799 -4.27060445 -0.96145142
N  -1.60724116 -3.94963727 -0.52088678
C  -0.61277478 -4.83600367 -0.73353403
C  3.04955481 -4.55595296 -1.43371843
C  1.79748126 -5.09737606 -1.18863323
H  3.86825085 -5.22532504 -1.66210447
H  1.66463443 -6.17034466 -1.20525373
H  -2.53544132 -4.32343449 -0.36211057
H  2.18117425 1.91101307 -0.87929655
S  -0.94424053 -6.45864511 -0.71650826
S  3.87002369 -0.01629274 -1.02308961
C  2.31453643 -0.85172043 -1.03011857
C  3.26930003 -3.19094615 -1.42958152
C  2.20704686 -2.28085405 -1.14516277
S  4.95752425 -2.78301213 -1.72539199
S  4.74884378 -0.95105276 -2.62712325
energy: -2481.6252344998938
energyOcCorr: -2481.6253989518
s2: -0.00000000
charge: 0.000000
dipole: 321.388377 -319.515855 1.872522 -678.437068 680.983346 2.546278 -350.303015 350.036987 -0.266028
quadrupole: 5770.064751 -5903.702412 -133.637661 6758.632847 -6895.001871 -136.369024 957.701407 -1090.213471 -132.512063 -1565.113450 1548.945378 -16.168072 -1781.657167 1777.468201 -4.188965 1487.732908 -1487.227455 0.505453
temp: 298.15 k
press: 1.0 bar
thermalcorrgfe: 0.177589015548 hartree
thermalcorrener: 0.241176898158 hartree
entropy: 0.56826 kJ.mol-1.K-1
thermalcorrenthalpy: 0.24212148006200002 hartree
