title: ChemShell job
elementType: c
basis: def2-TZVPD
elementType: n
elementType: h
elementType: s
elementType: li
method: uhf
method: dft
functional: cam-b3lyp
elementType: c n h s li
basis: def2-TZVPD def2-TZVPD def2-TZVPD def2-TZVPD def2-TZVPD
energy: -2492.891779395 hartree
formula: C19H7LiN3S4
InChI: InChI=1/C19H7N3S4.Li/c23-19-9-3-4-10-14-13(9)15-12-8(16(14)25-26-24-10)2-1-7-5-6-20-17(11(7)12)21-18(15)22-19;/h1-6,22H;/q-2;+2/rC19H7LiN3S4/c24-18-9-3-4-10-14-13(9)15-12-8(16(14)26-27-25-10)2-1-7-5-6-22-19(11(7)12)23(20-22)17(15)21-18/h1-6,21H
34 atoms
C  -1.19489586 -2.45166072 -0.49339895
N  -2.28651674 -1.7442678 -0.25210197
C  0.08453599 -1.90440179 -0.69766592
C  -2.16784375 -0.39861595 -0.19352298
C  0.21551797 -0.50618894 -0.63746593
C  -0.9337319 0.26412497 -0.38423895
N  -3.29702863 0.26166897 0.06061799
C  -0.8848959 1.66626081 -0.31040696
C  -3.24207563 1.60052982 0.13345498
C  -2.09519676 2.33788673 -0.03990099
C  1.46721284 0.10630099 -0.82079691
C  1.49527583 1.53174883 -0.76124291
C  0.37743896 2.27980074 -0.51883894
C  1.18990087 -2.74002069 -0.96000789
H  0.45398895 3.35901862 -0.48854994
H  -2.12838776 3.41627661 0.032335
H  -4.17998053 2.09962176 0.34318996
C  0.98761589 -4.13970753 -0.99964489
N  -1.31896185 -3.80249057 -0.54384294
C  -0.32049997 -4.69251747 -0.77214091
C  3.30992263 -4.4381665 -1.51748583
C  2.07696576 -4.98176943 -1.27163186
H  4.13231553 -5.09555142 -1.7718398
H  1.93016678 -6.05138432 -1.31319485
H  -2.24301274 -4.18662452 -0.38788996
H  2.43011572 2.05162777 -0.92093589
S  -0.68964492 -6.32814128 -0.76765191
S  4.14386053 0.11248399 -1.06812888
C  2.6002347 -0.72387292 -1.04084388
C  3.5410556 -3.05875465 -1.46354383
C  2.49040672 -2.14667276 -1.15318887
S  5.22800141 -2.6505677 -1.7526878
S  5.03337843 -0.8243179 -2.68521869
Li -4.30091951 -1.52957083 0.13210899
energy: -2492.8917793953196
energyOcCorr: -2492.8940727441
s2: 0.79722158
charge: -0.000000
dipole: 401.767439 -407.485080 -5.717641 -633.841265 637.394304 3.553040 -364.815398 366.066543 1.251145
quadrupole: 6365.550239 -6471.108929 -105.558690 6466.472981 -6645.665400 -179.192418 1016.770487 -1156.248420 -139.477933 -1751.584383 1763.291888 11.707506 -2009.419731 2010.316820 0.897089 1448.182567 -1456.306068 -8.123501
