title: ChemShell job
elementType: c
basis: def2-mSVP
elementType: n
elementType: h
elementType: s
elementType: li
method: uhf
method: dft
functional: pbeh-3c
elementType: c n h s li
basis: def2-mSVP def2-mSVP def2-mSVP def2-mSVP def2-mSVP
frequency: -33.09 -10.08 -0.00 -0.00 -0.00 -0.00 -0.00 0.0000 20.66 39.06 54.62 62.36 75.03 99.50 105.50 110.74 123.76 169.70 184.40 190.39 194.54 210.00 223.67 229.22 230.89 252.26 265.60 276.94 288.54 293.82 313.26 331.62 336.96 340.78 345.47 361.62 377.10 392.52 396.33 408.36 431.56 445.09 482.02 514.66 537.64 542.43 550.75 557.00 571.73 611.65 627.86 632.35 646.75 663.42 667.33 694.69 718.12 719.32 726.00 759.22 782.67 792.69 799.18 844.36 855.29 859.39 889.27 900.93 909.48 911.13 950.71 993.49 1037.47 1047.29 1059.17 1063.19 1097.68 1149.86 1166.00 1177.14 1195.93 1220.31 1265.02 1277.54 1296.67 1332.08 1343.46 1350.95 1368.92 1389.08 1396.86 1425.65 1437.19 1478.19 1486.03 1501.83 1540.87 1558.69 1574.36 1596.11 1604.99 1638.30 1645.80 1670.01 1711.84 1717.34 1732.47 3271.40 3282.67 3283.61 3294.80 3296.42 3302.21 3630.69
irintensity: 0.00000 0.00000 0.00000 0.00000 0.00000 0.00000 0.00000 0 0.29435 12.96723 29.10364 0.85390 15.92627 57.91581 64.67061 24.07589 43.92345 13.45669 29.96123 64.25572 1.31636 116.32792 27.96049 16.93400 83.99541 61.59492 142.13580 1.09777 36.17620 81.91540 30.33212 41.95506 10.74333 45.71101 60.62715 311.31358 192.59317 136.88181 28.21657 20.18506 162.38050 266.57983 5.99746 36.73323 91.69118 23.19923 5.11718 22.79121 2.67435 6.00097 22.49068 7.45204 4.65485 34.87291 79.32260 2.91981 20.56427 22.47054 80.12636 81.09644 1.91660 182.78359 31.98408 5.92802 39.38673 33.72939 21.35332 38.12187 22.24806 59.39010 12.53052 213.54039 0.06467 1.36569 0.56788 90.92279 455.59036 408.69863 70.34035 494.23048 14.98793 529.02872 98.16002 278.12832 108.82979 153.80968 24.54283 226.36884 1533.78284 33.51798 205.05266 66.87979 13.97362 836.30932 128.83614 0.86464 263.30152 116.26999 346.75666 151.15463 113.82835 883.23764 372.89796 590.14733 792.93381 1466.87521 847.98513 34.55301 3.66329 1.57660 3.85375 8.50083 7.97737 199.55518
energy: -2909.583570740 hartree
zeropoint: 0.22993713526 hartree
formula: C19H7Li4N3S5
InChI: InChI=1/C19H7N3S3.4Li.S2/c23-10-4-3-9-13-14(10)16(24)8-2-1-7-5-6-20-17-11(7)12(8)15(13)18(21-17)22-19(9)25;;;;;1-2/h1-6,22H;;;;;/q-2;;;+1;+2;-1/rC19H7Li4N3S5/c27-18-9-3-4-10-14-13(9)15-12-8(16(14)31-21-30-23(31)29(10)22(31)28-30)2-1-7-5-6-25-19(11(7)12)26(20-25)17(15)24-18/h1-6,24H
38 atoms
C  -1.26588076 -1.89902518 -0.78630671
N  -2.37450153 -1.20321197 -0.69221222
C  0.0317516 -1.37825984 -0.54713114
C  -2.27595044 0.09893919 -0.33273776
C  0.13699688 -0.03904539 -0.18449608
C  -1.04330578 0.71921902 -0.06740539
N  -3.43642631 0.75311172 -0.24794027
C  -1.01984628 2.07513517 0.29976206
C  -3.40674522 2.03522857 0.10809009
C  -2.24553674 2.73637519 0.39023436
C  1.39733894 0.55417824 0.02685059
C  1.39649874 1.93469898 0.42424405
C  0.25826607 2.6587068 0.56166613
C  1.17825717 -2.18833325 -0.65734263
C  2.48708672 -1.62312912 -0.43765235
C  2.56985141 -0.20287688 -0.18089808
H  0.31053807 3.69109568 0.8802223
H  -2.30054734 3.77826827 0.67361312
H  -4.36589991 2.53381541 0.17155538
C  3.60608979 -2.53359761 -0.51924254
C  0.98035879 -3.5478982 -1.00198368
N  -1.37141184 -3.20829644 -1.13616587
C  -0.33928436 -4.07811334 -1.26717816
C  3.34514982 -3.87539846 -0.84010621
C  2.09238896 -4.3731226 -1.08632417
H  4.18924182 -4.54785168 -0.8981436
H  1.96745708 -5.41661798 -1.34189145
S  -0.66847302 -5.64582276 -1.7213042
H  -2.30162554 -3.5674652 -1.31469815
S  5.3131048 -2.25784744 -0.26619647
S  7.45931986 1.14038627 -0.97008139
H  2.34161204 2.41032683 0.64175003
S  4.05335894 0.71102322 -0.19990348
S  6.50225966 1.37747404 -2.71534319
Li 5.22473051 -0.57434524 -2.00441767
Li 6.02589862 -0.19693208 0.72561052
Li 4.28116641 2.31626534 -1.96657618
Li -4.44676979 -0.96238459 -0.79976761
energy: -2909.5835707403471
energyOcCorr: -2909.5821000977
s2: 0.75464538
charge: 1.000000
dipole: 742.045688 -744.576521 -2.530833 -335.112626 339.426051 4.313425 -299.352162 297.813858 -1.538305
quadrupole: 11519.388139 -11605.188312 -85.800173 5434.626783 -5589.355114 -154.728331 969.960980 -1108.884409 -138.923429 -280.645780 298.305702 17.659921 -1702.870522 1710.576856 7.706334 1037.991191 -1045.597921 -7.606730
temp: 298.15 k
press: 1.0 bar
thermalcorrgfe: 0.175551308618 hartree
thermalcorrener: 0.25461052870399997 hartree
entropy: 0.70452 kJ.mol-1.K-1
thermalcorrenthalpy: 0.255555110608 hartree
