title: ChemShell job
elementType: c
basis: def2-mSVP
elementType: n
elementType: h
elementType: s
elementType: li
method: uhf
method: dft
functional: pbeh-3c
elementType: c n h s li
basis: def2-mSVP def2-mSVP def2-mSVP def2-mSVP def2-mSVP
frequency: -13.87 -0.00 -0.00 -0.00 0.0000 0.0000 0.0000 12.93 50.42 59.85 62.29 62.93 74.30 103.00 119.44 137.25 167.39 179.84 184.89 188.30 193.64 204.69 221.96 229.97 244.08 265.45 274.19 278.08 301.95 310.86 320.70 335.96 338.51 349.95 356.30 378.09 388.98 397.67 412.89 422.01 444.59 472.17 481.68 505.26 514.38 537.93 541.57 549.25 558.02 571.73 628.20 634.34 648.36 665.52 669.87 696.46 718.45 720.40 726.85 761.21 781.27 792.71 797.82 843.75 856.00 859.22 888.67 898.89 909.23 911.96 951.57 994.72 1036.63 1048.18 1055.30 1070.01 1098.34 1150.31 1167.31 1177.90 1195.03 1218.03 1257.45 1276.43 1294.53 1334.67 1343.09 1348.11 1361.35 1389.09 1396.12 1426.20 1438.12 1472.78 1485.53 1501.58 1537.69 1555.36 1570.29 1598.48 1603.72 1638.96 1641.69 1668.79 1706.97 1716.36 1728.46 3269.76 3276.30 3278.64 3290.24 3290.28 3297.60 3633.03
irintensity: 0.00000 0.00000 0.00000 0.00000 0 0 0 1.25252 19.41821 43.55039 2.13221 16.23101 3.91857 76.42013 9.68917 8.42966 19.27088 44.61382 23.15192 93.44126 92.17915 17.39143 20.24935 38.17451 65.85468 206.74255 16.35179 167.32116 36.01082 15.14950 5.88358 100.45831 2.15739 137.17434 52.13229 139.66786 280.17991 24.29141 98.59844 102.45809 50.83646 86.09167 4.08763 331.52395 38.10457 101.13685 31.43849 2.76125 22.75571 1.76318 21.97064 6.67730 5.37828 33.75876 84.97844 7.74385 19.19230 18.40045 83.96246 110.00365 2.41546 198.08186 36.28797 5.37961 45.01819 62.19121 20.44142 39.27305 72.46180 13.30902 10.16991 214.25835 0.08415 1.99306 1.94932 181.43321 470.72776 501.94861 67.86234 531.03079 16.12273 665.14694 62.27694 316.85179 209.97408 390.86306 32.46318 457.75951 1266.59647 19.83851 217.68111 86.74330 30.67181 991.45547 187.04759 3.47217 139.89651 73.09300 407.43502 265.21205 24.40142 909.38376 383.98252 718.35531 896.69320 1953.23586 650.27004 34.70883 3.85309 1.33940 16.92726 1.13128 9.39447 199.81285
energy: -2909.748454858 hartree
zeropoint: 0.23039419101999997 hartree
formula: C19H7Li4N3S5
InChI: InChI=1/C19H7N3S3.4Li.S2/c23-10-4-3-9-13-14(10)16(24)8-2-1-7-5-6-20-17-11(7)12(8)15(13)18(21-17)22-19(9)25;;;;;1-2/h1-6,22H;;;;;/q-2;;;;+2;/rC19H7Li4N3S5/c27-18-9-3-4-10-14-13(9)15-12-8(16(14)31-21-28(10)22(31)30-23(31)29(21)30)2-1-7-5-6-25-19(11(7)12)26(20-25)17(15)24-18/h1-6,24H
38 atoms
C  -1.26430886 -1.89873079 -0.80047491
N  -2.37812573 -1.20507186 -0.71491892
C  0.026369 -1.38171484 -0.54110694
C  -2.28741974 0.09218499 -0.34206596
C  0.12517598 -0.042667 -0.16588698
C  -1.05876988 0.71231292 -0.051784
N  -3.44954061 0.74553392 -0.27650797
C  -1.04156188 2.06631377 0.32240097
C  -3.42482161 2.02754877 0.08462699
C  -2.27213974 2.72697269 0.39170595
C  1.37989784 0.55023894 0.05447399
C  1.37338684 1.92645078 0.45565995
C  0.23225498 2.6497757 0.59537493
C  1.17629087 -2.19082275 -0.64581792
C  2.48313172 -1.62738082 -0.41575195
C  2.56360371 -0.20420998 -0.15549498
H  0.28196297 3.68324358 0.9129759
H  -2.33165173 3.76906057 0.67586392
H  -4.3850025 2.52609672 0.12992299
C  3.60531059 -2.53554271 -0.48479195
C  0.98327389 -3.5495576 -0.99302589
N  -1.36328085 -3.20350064 -1.16724887
C  -0.33052396 -4.07512054 -1.27836386
C  3.34771562 -3.88067356 -0.80900091
C  2.09854876 -4.3763505 -1.06588388
H  4.19335552 -4.55250248 -0.8609979
H  1.97511978 -5.41972338 -1.32438885
S  -0.65968792 -5.64446936 -1.7358668
H  -2.29037974 -3.56215459 -1.36104985
S  5.3023594 -2.26692975 -0.19898098
S  7.31063317 1.18125587 -1.00457989
H  2.31948674 2.40448073 0.66572992
S  4.03856654 0.68664192 -0.16172798
S  6.43913827 1.32425885 -2.97007566
Li 5.49311038 -0.47511494 -1.85867979
Li 6.05825231 -0.16908398 0.68347792
Li 5.3092464 2.52808371 -1.32072685
Li -4.4427655 -0.94780089 -0.8907349
energy: -2909.7484548580292
energyOcCorr: -2909.7497359789
s2: -0.00000000
charge: 0.000000
dipole: 740.524300 -752.170112 -11.645811 -335.536563 338.478120 2.941557 -299.793094 302.458226 2.665133
quadrupole: 11481.072854 -11676.459280 -195.386426 5436.899429 -5603.239766 -166.340337 1030.973494 -1196.024303 -165.050808 -274.641778 278.454432 3.812654 -1726.312961 1776.665121 50.352160 1030.569088 -1028.405367 2.163722
temp: 298.15 k
press: 1.0 bar
thermalcorrgfe: 0.175235178384 hartree
thermalcorrener: 0.255528449022 hartree
entropy: 0.71538 kJ.mol-1.K-1
thermalcorrenthalpy: 0.256473030926 hartree
