title: ChemShell job
elementType: c
basis: def2-TZVPD
elementType: n
elementType: h
elementType: s
elementType: li
method: uhf
method: dft
functional: cam-b3lyp
elementType: c n h s li
basis: def2-TZVPD def2-TZVPD def2-TZVPD def2-TZVPD def2-TZVPD
energy: -2913.920985094 hartree
formula: C19H7Li4N3S5
InChI: InChI=1/C19H7N3S3.4Li.S2/c23-10-4-3-9-13-14(10)16(24)8-2-1-7-5-6-20-17-11(7)12(8)15(13)18(21-17)22-19(9)25;;;;;1-2/h1-6,22H;;;;;/q-2;;;;+2;/rC19H7Li4N3S5/c27-18-9-3-4-10-14-13(9)15-12-8(16(14)31-21-28(10)22(31)30-23(31)29(21)30)2-1-7-5-6-25-19(11(7)12)26(20-25)17(15)24-18/h1-6,24H
38 atoms
C  -1.26430886 -1.89873079 -0.80047491
N  -2.37812573 -1.20507186 -0.71491892
C  0.026369 -1.38171484 -0.54110694
C  -2.28741974 0.09218499 -0.34206596
C  0.12517598 -0.042667 -0.16588698
C  -1.05876988 0.71231292 -0.051784
N  -3.44954061 0.74553392 -0.27650797
C  -1.04156188 2.06631377 0.32240097
C  -3.42482161 2.02754877 0.08462699
C  -2.27213974 2.72697269 0.39170595
C  1.37989784 0.55023894 0.05447399
C  1.37338684 1.92645078 0.45565995
C  0.23225498 2.6497757 0.59537493
C  1.17629087 -2.19082275 -0.64581792
C  2.48313172 -1.62738082 -0.41575195
C  2.56360371 -0.20420998 -0.15549498
H  0.28196297 3.68324358 0.9129759
H  -2.33165173 3.76906057 0.67586392
H  -4.3850025 2.52609672 0.12992299
C  3.60531059 -2.53554271 -0.48479195
C  0.98327389 -3.5495576 -0.99302589
N  -1.36328085 -3.20350064 -1.16724887
C  -0.33052396 -4.07512054 -1.27836386
C  3.34771562 -3.88067356 -0.80900091
C  2.09854876 -4.3763505 -1.06588388
H  4.19335552 -4.55250248 -0.8609979
H  1.97511978 -5.41972338 -1.32438885
S  -0.65968792 -5.64446936 -1.7358668
H  -2.29037974 -3.56215459 -1.36104985
S  5.3023594 -2.26692975 -0.19898098
S  7.31063317 1.18125587 -1.00457989
H  2.31948674 2.40448073 0.66572992
S  4.03856654 0.68664192 -0.16172798
S  6.43913827 1.32425885 -2.97007566
Li 5.49311038 -0.47511494 -1.85867979
Li 6.05825231 -0.16908398 0.68347792
Li 5.3092464 2.52808371 -1.32072685
Li -4.4427655 -0.94780089 -0.8907349
energy: -2913.9209850937568
energyOcCorr: -2913.9265364671
s2: 0.00000000
charge: 0.000000
dipole: 740.524300 -752.367404 -11.843104 -335.536563 338.722277 3.185714 -299.793094 302.650419 2.857325
quadrupole: 11481.072854 -11690.916487 -209.843633 5436.899429 -5614.358626 -177.459198 1030.973494 -1198.529176 -167.555682 -274.641778 276.762424 2.120646 -1726.312961 1778.196686 51.883726 1030.569088 -1030.504788 0.064301
