title: ChemShell job
elementType: c
basis: def2-mSVP
elementType: n
elementType: h
elementType: s
elementType: li
method: uhf
method: dft
functional: pbeh-3c
elementType: c n h s li
basis: def2-mSVP def2-mSVP def2-mSVP def2-mSVP def2-mSVP
frequency: -14.99 -0.00 -0.00 -0.00 -0.00 -0.00 -0.00 8.60 17.54 49.33 57.15 62.56 64.49 78.00 101.23 105.90 125.73 146.50 165.42 177.92 184.94 197.75 198.00 220.60 231.44 238.32 241.52 261.16 274.84 289.95 296.45 318.45 324.62 326.43 335.56 356.17 366.45 373.25 377.80 396.77 402.03 408.88 425.78 448.86 460.52 468.21 494.17 514.85 535.09 540.48 544.34 559.16 570.44 607.07 620.26 626.60 657.46 663.12 688.93 703.52 711.80 734.35 754.35 774.18 780.12 789.23 828.59 837.04 850.50 861.01 883.70 893.20 901.72 944.69 984.59 1004.66 1019.50 1033.62 1059.73 1082.92 1145.33 1163.22 1173.16 1187.36 1210.75 1240.45 1263.12 1286.38 1314.12 1328.14 1331.58 1338.39 1348.21 1379.52 1413.71 1445.63 1449.18 1472.72 1492.55 1494.22 1531.36 1559.79 1576.50 1594.97 1613.91 1632.57 1640.75 1678.22 1693.25 1715.55 3257.88 3263.01 3268.72 3285.96 3289.30 3291.73 3641.81
irintensity: 0.00000 0.00000 0.00000 0.00000 0.00000 0.00000 0.00000 84.02954 9.44436 23.33219 14.16837 1.50637 5.37228 3.72504 24.75891 69.16234 14.90265 149.84855 16.66220 7.87078 14.13171 12.95961 40.85681 4.30325 89.68854 18.69758 91.66484 166.69577 64.35084 29.72586 41.35877 51.58788 2.53179 4.86072 50.67619 98.13377 9.10865 48.74847 127.89354 65.08631 287.75326 191.04222 102.88785 9.35874 4.98506 94.15286 240.75807 38.46813 108.36281 8.41307 23.64176 37.68955 7.52408 11.73350 15.18789 26.25915 26.32239 43.49809 112.88121 5.02533 82.40318 71.02118 196.59282 26.37382 37.20619 90.97802 1.19927 42.15445 50.41729 10.05062 56.89818 53.73108 1.87845 32.72272 256.85787 0.42440 0.14701 0.03689 52.87471 238.69070 678.04336 7.48256 323.31093 14.97233 281.37030 1030.56444 849.51004 42.14564 167.92568 59.66889 378.17011 1565.47027 362.91594 33.23244 159.15331 282.14334 285.99185 824.94451 187.97208 35.13716 141.39709 68.01486 485.21981 61.53075 127.74808 204.45904 657.45070 208.09346 377.10920 1435.92325 50.64833 26.41066 26.86933 36.29617 4.89205 3.06423 173.46762
energy: -2917.315617879 hartree
zeropoint: 0.22959434344 hartree
formula: C19H7Li5N3S5
InChI: InChI=1/C19H7N3S3.5Li.S2/c23-10-4-3-9-13-14(10)16(24)8-2-1-7-5-6-20-17-11(7)12(8)15(13)18(21-17)22-19(9)25;;;;;;1-2/h1-6,22H;;;;;;/q-2;;;;;+2;/rC19H7Li5N3S5/c28-18-9-3-4-10-14-13(9)15-12-8(16(14)31-21-29(10)23(31)32-22-30(32)24(31)32)2-1-7-5-6-26-19(11(7)12)27(20-26)17(15)25-18/h1-6,25H
39 atoms
C  -1.25290556 -1.89511808 -0.79269531
N  -2.38358023 -1.20196907 -0.70222532
C  0.027743 -1.37975065 -0.54620414
C  -2.30346644 0.09266859 -0.33105006
C  0.11854248 -0.0256296 -0.16930258
C  -1.06737068 0.72192182 -0.0460943
N  -3.4669108 0.74088071 -0.25723417
C  -1.05517968 2.07650606 0.33176416
C  -3.44573501 2.03617257 0.11142649
C  -2.30733894 2.73568309 0.41237145
C  1.37224234 0.56510834 0.0432384
C  1.36259425 1.93158168 0.44217735
C  0.20742558 2.6564083 0.59114073
C  1.18038167 -2.19213955 -0.65830453
C  2.49381482 -1.62209532 -0.42497255
C  2.55979651 -0.20604028 -0.16930558
H  0.26373827 3.69189148 0.9041782
H  -2.36762653 3.77696937 0.69921812
H  -4.4119351 2.52405191 0.16097278
C  3.60242719 -2.53806341 -0.49249185
C  0.98845359 -3.5494863 -1.01542028
N  -1.35221965 -3.19804184 -1.15341287
C  -0.31814427 -4.06499094 -1.28352315
C  3.35129072 -3.88265636 -0.84358581
C  2.11275846 -4.3884898 -1.10942707
H  4.20470072 -4.54552448 -0.8992476
H  1.98389378 -5.42712098 -1.38066184
S  -0.66842022 -5.64919516 -1.7480899
H  -2.27889234 -3.56022919 -1.33798395
S  5.32603809 -2.28076614 -0.17432198
S  7.28569627 1.21309946 -0.96623399
H  2.30792404 2.41758733 0.63934573
S  4.05049934 0.71182642 -0.17602268
S  6.44582207 1.26549185 -2.96758096
Li 5.42626189 -0.53130714 -1.8052168
Li 5.95866263 -0.20702648 0.76424061
Li 5.13156302 2.48366642 -1.41447844
Li -4.4161078 -0.95877089 -0.85225021
Li 8.831548 1.31232855 -2.79018609
energy: -2917.3156178792115
energyOcCorr: -2917.3175796295
s2: 0.81360870
charge: 0.000000
dipole: 787.783219 -786.821571 0.961648 -328.515356 335.554777 7.039422 -314.668819 313.553676 -1.115144
quadrupole: 12292.172109 -12291.003697 1.168413 5462.621738 -5655.590739 -192.969001 1116.787358 -1262.844520 -146.057162 -184.113278 230.297664 46.184386 -1982.984220 1958.729088 -24.255132 1014.014250 -1031.233272 -17.219023
temp: 298.15 k
press: 1.0 bar
thermalcorrgfe: 0.17070270876399998 hartree
thermalcorrener: 0.25673202919 hartree
entropy: 0.76587 kJ.mol-1.K-1
thermalcorrenthalpy: 0.257676611094 hartree
