title: ChemShell job
elementType: c
basis: def2-TZVPD
elementType: n
elementType: h
elementType: s
elementType: li
method: uhf
method: dft
functional: cam-b3lyp
elementType: c n h s li
basis: def2-TZVPD def2-TZVPD def2-TZVPD def2-TZVPD def2-TZVPD
energy: -2508.080772071 hartree
formula: C19H7Li3N3S4
InChI: InChI=1/C19H7N3S4.3Li/c23-16-8-2-1-7-5-6-20-17-11(7)12(8)15-13-9(19(24)22-18(15)21-17)3-4-10(26-25)14(13)16;;;/h1-6,22H;;;/q-2;;;+2/rC19H7Li3N3S4/c26-18-9-3-4-10-14-13(9)15-12-8(16(14)27-21-29-22(27)28(10)29)2-1-7-5-6-24-19(11(7)12)25(20-24)17(15)23-18/h1-6,23H
36 atoms
C  -1.29496885 -2.18641575 -0.69165392
N  -2.40072573 -1.49149083 -0.46873295
C  0.002472 -1.64486681 -0.67820992
C  -2.27181774 -0.16643898 -0.22274398
C  0.14285098 -0.26547197 -0.45727695
C  -1.01963889 0.49091395 -0.22052597
N  -3.41317062 0.48300795 0.00733
C  -0.96745089 1.87666079 -0.000419
C  -3.35334762 1.8046228 0.23790997
C  -2.19171275 2.53669371 0.24151697
C  1.40104284 0.34876996 -0.53028194
C  1.43304584 1.7579108 -0.32609496
C  0.31047397 2.49045972 -0.05312299
C  1.12924487 -2.46639372 -0.8577409
C  2.44209972 -1.87445379 -0.80298491
C  2.54924871 -0.44972995 -0.8242039
H  0.39245196 3.55585759 0.11798599
H  -2.22225575 3.60188659 0.42422795
H  -4.30214451 2.29307274 0.42369595
C  3.5347386 -2.80263568 -0.76601691
C  0.93434689 -3.85035356 -1.09756687
N  -1.41277984 -3.5097816 -0.95349489
C  -0.38818795 -4.38234251 -1.17864586
C  3.31576262 -4.16344753 -1.03374488
C  2.06537377 -4.68280347 -1.24200286
H  4.17030152 -4.82826245 -1.03546888
H  1.92900178 -5.73482335 -1.44954984
S  -0.77748291 -5.98745932 -1.51997983
H  -2.34817774 -3.89468456 -0.98738089
S  5.11444342 -2.46831272 -0.049616
S  6.50965226 -2.25063875 -1.61583381
H  2.38923273 2.26221574 -0.37503396
S  3.96764155 0.40468795 -1.38295985
Li 4.91549645 -1.11537688 -2.97393666
Li 5.98532132 -0.24910497 -0.33289296
Li -4.4361335 -1.26189986 -0.22545897
energy: -2508.0807720714465
energyOcCorr: -2508.0852385625
s2: 0.80771271
charge: -0.000000
dipole: 477.128173 -480.750685 -3.622511 -591.210940 596.684968 5.474028 -301.410993 301.613737 0.202745
quadrupole: 7920.418034 -8013.490191 -93.072158 6080.215555 -6285.952635 -205.737080 737.708632 -869.991301 -132.282669 -2249.225449 2276.151505 26.926057 -1325.265395 1317.655428 -7.609967 1522.347004 -1534.302195 -11.955191
