title: ChemShell job
elementType: c
basis: def2-TZVPD
elementType: n
elementType: h
elementType: s
elementType: li
method: uhf
method: dft
functional: cam-b3lyp
elementType: c n h s li
basis: def2-TZVPD def2-TZVPD def2-TZVPD def2-TZVPD def2-TZVPD
energy: -2094.673706295 hartree
formula: C19H7LiN3S3
InChI: InChI=1/C19H7N3S3.Li/c23-19-9-3-4-10-14-13(9)15-12-8(16(14)25-24-10)2-1-7-5-6-20-17(11(7)12)21-18(15)22-19;/h1-6,22H;/q-2;+2/rC19H7LiN3S3/c24-18-9-3-4-10-14-13(9)15-12-8(16(14)26-25-10)2-1-7-5-6-22-19(11(7)12)23(20-22)17(15)21-18/h1-6,21H
33 atoms
C  -1.19324586 -2.6389297 -0.52020594
N  -2.27744774 -1.90848378 -0.29606297
C  0.08933499 -2.10389576 -0.68544192
C  -2.12553076 -0.56310493 -0.22155297
C  0.26615097 -0.70710992 -0.60973893
C  -0.8697669 0.08069499 -0.37056596
N  -3.24346863 0.12520899 0.003317
C  -0.78613891 1.48196083 -0.27778497
C  -3.15789164 1.46595283 0.08990199
C  -1.99344177 2.17884275 -0.037151
C  1.53368783 -0.10857799 -0.76700491
C  1.60562982 1.30473985 -0.66872592
C  0.49347894 2.07154376 -0.43330895
C  1.17212686 -2.96205266 -0.9220499
H  0.59154193 3.14688764 -0.36552196
H  -2.00512778 3.25669663 0.045514
H  -4.09143153 1.98310378 0.27322197
C  1.01124188 -4.35657951 -0.99724389
N  -1.30803885 -3.99417355 -0.59855893
C  -0.30573997 -4.89690445 -0.82314291
C  3.40330161 -4.58526948 -1.40278684
C  2.15433676 -5.15540342 -1.24044786
H  4.26009452 -5.21956441 -1.58854782
H  2.04185477 -6.22888329 -1.29984286
H  -2.23519375 -4.38362451 -0.47745294
H  2.56294571 1.8008338 -0.78173291
S  -0.68768392 -6.53142426 -0.8762109
S  4.26736551 -0.42745795 -1.23972586
C  2.6183077 -0.98282189 -1.00969788
C  3.5521906 -3.19935164 -1.32658985
C  2.44799072 -2.37122373 -1.08552788
S  5.07955742 -2.35294174 -1.51544383
Li -4.28734851 -1.63244681 0.038057
energy: -2094.6737062950083
energyOcCorr: -2094.6761626041
s2: 0.81269451
charge: -0.000000
dipole: 261.734568 -266.049799 -4.315231 -673.230606 677.156719 3.926112 -280.200791 281.161222 0.960431
quadrupole: 4885.197326 -4970.819683 -85.622357 6760.424956 -6939.422862 -178.997906 562.721469 -692.561340 -129.839871 -1547.903328 1557.167553 9.264226 -1155.921248 1154.071083 -1.850165 1401.440333 -1410.275232 -8.834899
