title: ChemShell job
elementType: c
basis: def2-TZVPD
elementType: n
elementType: h
elementType: s
elementType: li
method: uhf
method: dft
functional: cam-b3lyp
elementType: c n h s li
basis: def2-TZVPD def2-TZVPD def2-TZVPD def2-TZVPD def2-TZVPD
energy: -2914.042939819 hartree
formula: C19H7Li4N3S5
InChI: InChI=1/C19H7N3S3.4Li.S2/c23-10-4-3-9-13-14(10)16(24)8-2-1-7-5-6-20-17-11(7)12(8)15(13)18(21-17)22-19(9)25;;;;;1-2/h1-6,22H;;;;;/q-2;;;;+2;/rC19H7Li4N3S5/c27-18-9-3-4-10-14-13(9)15-12-8(16(14)30-21-29-23(30)22(30,28(10)23)31(21,23)29)2-1-7-5-6-25-19(11(7)12)26(20-25)17(15)24-18/h1-6,24H
38 atoms
C  -1.25793786 -1.89720079 -0.78793491
N  -2.39020173 -1.20520186 -0.69612092
C  0.022509 -1.37764584 -0.54957894
C  -2.31197074 0.09229699 -0.33327996
C  0.11213099 -0.021253 -0.17908198
C  -1.07541488 0.72573792 -0.057672
N  -3.47784161 0.73775991 -0.25524597
C  -1.06497488 2.08168176 0.31620296
C  -3.45711161 2.03551677 0.10739999
C  -2.31857474 2.73834969 0.39920995
C  1.36555884 0.56933894 0.038613
C  1.35232085 1.93799378 0.43133895
C  0.19677598 2.6637687 0.57212394
C  1.17677586 -2.18871975 -0.66290292
C  2.49125372 -1.61534782 -0.43522995
C  2.55837471 -0.20150098 -0.15695198
H  0.25185297 3.70116158 0.8792059
H  -2.38013673 3.78043757 0.68299692
H  -4.4236135 2.52193971 0.16037898
C  3.60260959 -2.52830871 -0.52631194
C  0.98307289 -3.5491336 -1.01250389
N  -1.35762785 -3.20284364 -1.14028787
C  -0.32370196 -4.06961954 -1.27011286
C  3.34833162 -3.87600056 -0.8641049
C  2.10765976 -4.3871025 -1.10869987
H  4.20245053 -4.53692948 -0.9310549
H  1.97798577 -5.42751238 -1.37034584
S  -0.67414392 -5.65770336 -1.72108081
H  -2.28515974 -3.5670776 -1.31727085
S  5.33213239 -2.26124274 -0.26903197
S  7.30105917 1.21937586 -0.95818289
H  2.29694674 2.42409873 0.62909893
S  4.05052554 0.71409192 -0.08823599
S  6.54980626 1.25277386 -2.97957366
Li 5.48768038 -0.43047395 -1.7888848
Li 6.03187532 -0.21358698 0.69852392
Li 5.19879041 2.37972973 -1.43161084
Li -4.4222805 -0.96868989 -0.83021691
energy: -2914.0429398188189
energyOcCorr: -2914.0550109170
s2: 0.81663025
charge: -1.000000
dipole: 740.669036 -755.245254 -14.576218 -335.277434 340.624144 5.346710 -299.899068 303.777451 3.878384
quadrupole: 11580.737589 -11844.488612 -263.751023 5438.625201 -5656.250883 -217.625682 1029.119231 -1204.716650 -175.597420 -289.890146 297.174587 7.284441 -1758.453699 1812.544518 54.090819 1059.064878 -1068.834720 -9.769843
