title: ChemShell job
elementType: c
basis: def2-TZVPD
elementType: n
elementType: h
elementType: s
elementType: li
method: uhf
method: dft
functional: cam-b3lyp
elementType: c n h s li
basis: def2-TZVPD def2-TZVPD def2-TZVPD def2-TZVPD def2-TZVPD
energy: -2928.930564133 hartree
formula: C19H7Li6N3S5
InChI: InChI=1/C19H7N3S3.6Li.2S/c23-10-4-3-9-13-14(10)16(24)8-2-1-7-5-6-20-17-11(7)12(8)15(13)18(21-17)22-19(9)25;;;;;;;;/h1-6,22H;;;;;;;;/rC19H7Li6N3S5/c29-19-9-3-4-10-14-13(9)15-12-8(2-1-7-5-6-26-17(11(7)12)27-18(15)28-19)16(14)31-21-33-22-32(23-33)20-30(10,24(31)33)25(31,32)33/h1-6,28H
40 atoms
C  -1.8037828 -2.19753475 -0.37860496
N  -2.89458467 -1.51408683 -0.16940198
C  -0.49777394 -1.65604881 -0.48103695
C  -2.78703168 -0.16840298 -0.05370799
C  -0.36961096 -0.27603797 -0.37562096
C  -1.53540983 0.48726094 -0.16196298
N  -3.91650756 0.51290394 0.15699398
C  -1.47077683 1.89100779 -0.07313299
C  -3.83607356 1.83189979 0.25620297
C  -2.6641487 2.57079171 0.14724598
C  0.8923229 0.33986096 -0.54248994
C  0.9239639 1.7736928 -0.46105695
C  -0.18699898 2.51090772 -0.22357698
C  0.62803493 -2.47910472 -0.66397092
C  1.93611078 -1.89497478 -0.73373091
C  2.02540077 -0.45138095 -0.80599891
H  -0.11501499 3.58839459 -0.14767598
H  -2.69110369 3.64897258 0.22996197
H  -4.77262446 2.35068173 0.43050695
C  3.04324165 -2.81200868 -0.73337292
C  0.41213495 -3.87553856 -0.77257191
N  -1.93262378 -3.5552016 -0.50749794
C  -0.92741289 -4.4331835 -0.71102992
C  2.78491968 -4.17501753 -0.8894339
C  1.51167383 -4.70021047 -0.93429989
H  3.62542759 -4.85481445 -0.9242499
H  1.37251084 -5.76691234 -1.04591788
S  -1.28447286 -6.05289831 -0.8684919
H  -2.87168667 -3.92945556 -0.44695395
S  4.72120346 -2.44335972 -0.39387896
S  7.49582315 -1.66982881 -2.81675168
H  1.87368579 2.27550474 -0.57623693
S  3.45773061 0.36366496 -1.35754284
S  6.90106322 0.65120192 -1.09464187
Li 7.85458111 0.63687193 -3.28672863
Li 5.2755044 -0.92087189 -2.25582874
Li 5.15861041 2.24521374 -1.42025384
Li 8.52505303 -1.02694788 -0.74475291
Li 5.13782342 -0.20032898 0.33557196
Li 6.39101327 -3.5299236 -1.80381179
energy: -2928.9305641334481
energyOcCorr: -2928.9309582786
s2: 0.75753758
charge: 1.000000
dipole: 716.919292 -695.516680 21.402611 -558.742975 562.932038 4.189063 -358.483346 354.934629 -3.548717
quadrupole: 13071.838243 -12991.062692 80.775552 6244.716488 -6394.490002 -149.773514 1061.767992 -1195.560117 -133.792124 -1592.383635 1568.469416 -23.914218 -2821.465377 2768.061758 -53.403619 1133.625038 -1143.101209 -9.476171
