title: ChemShell job
elementType: c
basis: def2-TZVPD
elementType: n
elementType: h
elementType: s
elementType: li
method: uhf
method: dft
functional: cam-b3lyp
elementType: c n h s li
basis: def2-TZVPD def2-TZVPD def2-TZVPD def2-TZVPD def2-TZVPD
energy: -2929.105298969 hartree
formula: C19H7Li6N3S5
InChI: InChI=1/C19H7N3S3.6Li.2S/c23-10-4-3-9-13-14(10)16(24)8-2-1-7-5-6-20-17-11(7)12(8)15(13)18(21-17)22-19(9)25;;;;;;;;/h1-6,22H;;;;;;;;/rC19H7Li6N3S5/c29-19-9-3-4-10-14-13(9)15-12-8(2-1-7-5-6-26-17(11(7)12)27-18(15)28-19)16(14)31-21-33-22-32(23-33)20-30(10,24(31)33)25(31,32)33/h1-6,28H
40 atoms
C  -1.7739418 -2.19553975 -0.38464295
N  -2.86536868 -1.51263083 -0.17229098
C  -0.47007495 -1.65448381 -0.49248994
C  -2.75761469 -0.16679698 -0.05930599
C  -0.34036996 -0.27378097 -0.38919696
C  -1.50602383 0.48927994 -0.17244698
N  -3.88603456 0.51585494 0.15414898
C  -1.44065684 1.89276079 -0.08464499
C  -3.80458257 1.83544979 0.25179097
C  -2.6335277 2.57379371 0.14004098
C  0.91907889 0.34179496 -0.56502994
C  0.95088189 1.7742278 -0.48666495
C  -0.15849998 2.51217772 -0.24117797
C  0.65521493 -2.47850472 -0.67396492
C  1.96196078 -1.89385679 -0.74290692
C  2.05155377 -0.45204395 -0.83626291
H  -0.08586399 3.58954259 -0.16461598
H  -2.6591417 3.65212058 0.22159698
H  -4.74058346 2.35498473 0.42746695
C  3.07375765 -2.80389668 -0.71854592
C  0.44282995 -3.87557256 -0.77768291
N  -1.90018578 -3.5539366 -0.51169994
C  -0.8944179 -4.4324875 -0.71453292
C  2.81877168 -4.16962753 -0.8785729
C  1.54804382 -4.69718447 -0.9328189
H  3.66014759 -4.84899345 -0.9012059
H  1.41178484 -5.76450835 -1.04287688
S  -1.25574286 -6.05313231 -0.8686179
H  -2.83867568 -3.92914055 -0.45036995
S  4.74076846 -2.43514073 -0.33759896
S  7.42733616 -1.93091578 -3.03322466
H  1.89975679 2.27571074 -0.60972093
S  3.4763646 0.34213896 -1.41945984
S  6.81405323 0.92496589 -0.8717849
Li 7.65896713 0.41372395 -3.06036665
Li 5.50934837 -0.8444109 -2.10407776
Li 5.01541543 2.33972374 -1.19095587
Li 8.04689809 -1.08848488 -0.91939889
Li 5.09476242 -0.13428898 0.38101795
Li 6.23533929 -3.56332359 -1.95762578
energy: -2929.1052989694936
energyOcCorr: -2929.1128783376
s2: -0.00000000
charge: 0.000000
dipole: 717.845382 -710.382894 7.462488 -558.670431 564.245473 5.575042 -358.723381 359.477744 0.754364
quadrupole: 12810.867182 -12942.623497 -131.756315 6321.933567 -6491.035897 -169.102330 1100.233334 -1266.270149 -166.036815 -1632.966201 1627.723071 -5.243129 -2787.478486 2793.611051 6.132566 1202.342093 -1221.094966 -18.752873
