title: ChemShell job
elementType: c
basis: def2-mSVP
elementType: n
elementType: h
elementType: s
elementType: li
method: uhf
method: dft
functional: pbeh-3c
elementType: c n h s li
basis: def2-mSVP def2-mSVP def2-mSVP def2-mSVP def2-mSVP
frequency: -0.00 -0.00 -0.00 -0.00 0.0000 0.0000 19.01 38.47 55.00 64.87 68.42 92.11 102.69 109.89 145.95 162.50 178.30 183.22 190.19 202.02 224.65 227.39 247.85 264.62 277.41 289.07 304.92 328.36 334.84 339.58 348.73 356.95 371.66 387.16 396.32 402.63 408.28 438.90 441.96 481.64 484.61 509.56 536.99 542.81 546.51 559.32 568.72 619.51 625.38 638.02 663.00 678.23 696.95 710.84 716.98 719.32 759.09 778.09 790.33 796.42 838.05 845.37 856.14 872.19 891.47 906.71 915.14 953.70 996.07 1032.99 1034.56 1050.62 1073.04 1106.97 1148.81 1167.46 1174.18 1194.02 1214.36 1254.03 1270.91 1291.99 1338.49 1346.15 1358.92 1362.58 1386.01 1395.89 1426.50 1438.78 1473.69 1483.33 1501.70 1531.99 1551.80 1568.04 1593.37 1602.80 1628.84 1637.26 1663.22 1704.55 1715.32 1726.84 3273.07 3275.64 3276.63 3286.70 3293.83 3295.48 3639.92
irintensity: 0.00000 0.00000 0.00000 0.00000 0 0 16.88562 14.85722 3.76656 1.77722 31.05488 63.57116 24.12049 45.67885 13.35872 14.81382 13.47984 60.01769 73.38173 17.97442 24.65172 18.84798 38.06673 29.86990 166.81866 174.83735 81.22685 29.37224 60.58083 27.42912 269.98369 151.66232 142.63436 218.15971 85.85269 52.97732 26.18931 157.02770 83.36635 232.22444 11.41508 43.34075 114.48369 28.28742 17.05104 15.06887 3.04013 14.48406 27.88051 0.91271 32.86335 101.56989 46.44876 70.11757 20.65063 29.19479 119.13779 48.40963 23.43794 219.34444 20.05438 11.13724 115.66114 33.58404 18.36103 91.07351 19.51028 17.07329 162.96222 0.34177 24.04600 6.19681 123.99166 495.35508 550.89931 131.17618 412.33319 62.49400 640.85815 131.21154 306.84185 206.18255 584.46002 526.20771 187.84930 904.30745 218.80088 69.59752 73.92478 56.57944 931.98605 172.08883 2.25131 92.12594 134.42408 418.14995 240.51803 7.07677 962.46923 329.65158 651.68071 789.89514 1926.06916 685.30500 2.71691 32.89572 3.61132 4.02676 10.91860 14.13946 205.80405
energy: -2511.978917037 hartree
zeropoint: 0.22875640788 hartree
formula: C19H7Li4N3S4
InChI: InChI=1/C19H7N3S3.4Li.S/c23-10-4-3-9-13-14(10)16(24)8-2-1-7-5-6-20-17-11(7)12(8)15(13)18(21-17)22-19(9)25;;;;;/h1-6,22H;;;;;/q-2;;;;+2;/rC19H7Li4N3S4/c27-18-9-3-4-10-14-13(9)15-12-8(16(14)29-22-30-21-28(10)23(29)30)2-1-7-5-6-25-19(11(7)12)26(20-25)17(15)24-18/h1-6,24H
37 atoms
C  -1.71330295 -2.14306516 -0.65262899
N  -2.77976428 -1.41762798 -0.39401295
C  -0.39497631 -1.64033298 -0.66478975
C  -2.60045691 -0.09751928 -0.14841092
C  -0.2017066 -0.27905136 -0.43127287
C  -1.33348883 0.51601743 -0.17410066
N  -3.71739056 0.58419943 0.11713977
C  -1.22847565 1.89883599 0.04901291
C  -3.60826973 1.89151658 0.35202345
C  -2.41413996 2.58943934 0.32498921
C  1.08038008 0.29528643 -0.51573212
C  1.16248044 1.71082114 -0.31782814
C  0.07560928 2.47596897 -0.02963955
C  0.70604956 -2.49449203 -0.85243438
C  2.0313779 -1.96527018 -0.76933639
C  2.19907161 -0.53077854 -0.80433372
H  0.19284036 3.53786341 0.14283882
H  -2.40912797 3.6540536 0.51348067
H  -4.5313744 2.41320552 0.56846023
C  3.09507352 -2.92287031 -0.63710113
C  0.45677499 -3.86758798 -1.08789273
N  -1.88437582 -3.46725309 -0.91887942
C  -0.89286378 -4.36605051 -1.16493338
C  2.82377689 -4.26226355 -0.9756117
C  1.55310657 -4.72052232 -1.21930946
H  3.64519767 -4.9665685 -0.96362583
H  1.38927534 -5.76640717 -1.44416697
S  -1.32131471 -5.94106375 -1.51644201
H  -2.83358825 -3.81795881 -0.94159145
S  4.60881173 -2.62368003 0.1316889
S  7.12524707 -1.12246955 -2.16049738
H  2.13461964 2.18048208 -0.37744341
S  3.63509872 0.25191418 -1.34627606
Li 4.98615646 -1.03906761 -2.94243143
Li 5.70195574 -0.54305681 -0.40344199
Li 6.55982321 -3.13446316 -1.26874986
Li -4.82072549 -1.14131283 -0.08129981
energy: -2511.9789170366671
energyOcCorr: -2511.9809604982
s2: -0.00000000
charge: 0.000000
dipole: 388.793094 -399.074604 -10.281510 -583.699025 585.006725 1.307700 -305.267410 306.992025 1.724615
quadrupole: 8507.096737 -8667.236984 -160.140247 6025.873807 -6176.473790 -150.599983 850.442610 -998.277238 -147.834628 -1699.219572 1691.727546 -7.492026 -1478.637760 1499.853140 21.215381 1469.014474 -1468.344904 0.669571
temp: 298.15 k
press: 1.0 bar
thermalcorrgfe: 0.174892386564 hartree
thermalcorrener: 0.25300321594799996 hartree
entropy: 0.69617 kJ.mol-1.K-1
thermalcorrenthalpy: 0.253947797852 hartree
