title: ChemShell job
elementType: c
basis: def2-TZVPD
elementType: n
elementType: h
elementType: s
elementType: li
method: uhf
method: dft
functional: cam-b3lyp
elementType: c n h s li
basis: def2-TZVPD def2-TZVPD def2-TZVPD def2-TZVPD def2-TZVPD
energy: -2102.278819908 hartree
formula: C19H7Li2N3S3
InChI: InChI=1/C19H7N3S3.2Li/c23-10-4-3-9-13-14(10)16(24)8-2-1-7-5-6-20-17-11(7)12(8)15(13)18(21-17)22-19(9)25;;/h1-6,22H;;/q-4;2*+2/rC19H7Li2N3S3/c25-18-9-3-4-10-14-13(9)15-12-8(16(14)27-21-26-10)2-1-7-5-6-23-19(11(7)12)24(20-23)17(15)22-18/h1-6,22H
34 atoms
C  -1.36044485 -2.70572169 -0.45372595
N  -2.44894672 -2.00103777 -0.21496097
C  -0.06751199 -2.16396576 -0.61142393
C  -2.32228074 -0.65824593 -0.12690899
C  0.07367899 -0.77563791 -0.51120094
C  -1.08298188 -0.003606 -0.27040897
N  -3.45849361 0.00401 0.10414999
C  -1.03405188 1.39686984 -0.17236898
C  -3.40187261 1.33482585 0.19498698
C  -2.24212674 2.07029976 0.06681299
C  1.32705085 -0.16778398 -0.66104192
C  1.35478085 1.25661786 -0.54227494
C  0.24221197 2.00885777 -0.31614097
C  1.04837188 -2.98586866 -0.8750489
H  0.32585996 3.08482365 -0.23290397
H  -2.27191774 3.14775664 0.15192798
H  -4.34335851 1.83709679 0.38118096
C  0.79992891 -4.37403451 -1.01817788
N  -1.50242483 -4.05276654 -0.54856294
C  -0.50721594 -4.93178844 -0.82397391
C  3.11819765 -4.69381547 -1.51348383
C  1.86579979 -5.20397741 -1.37630585
H  3.92930156 -5.35980939 -1.7727288
H  1.68874081 -6.25976129 -1.53220983
H  -2.43005773 -4.4338385 -0.41339995
H  2.30803074 1.7556668 -0.63508793
S  -0.8912359 -6.56082526 -0.9009759
C  2.49802972 -0.96357789 -0.92383689
C  3.45036061 -3.33462362 -1.27267485
C  2.36645273 -2.40957073 -1.00563888
Li 5.82234834 -1.11523288 -0.37878395
S  3.93274556 -0.07303499 -1.19407087
S  5.14643142 -3.08961465 -1.32097885
Li -4.48215149 -1.7713748 0.12908799
energy: -2102.2788199082474
energyOcCorr: -2102.2828788884
s2: 0.00000000
charge: -0.000000
dipole: 225.110794 -230.442519 -5.331725 -711.747730 716.032374 4.284644 -259.556550 262.282611 2.726061
quadrupole: 5189.690559 -5258.325066 -68.634507 7096.988070 -7282.385844 -185.397774 517.443245 -654.293486 -136.850241 -1513.742947 1538.038086 24.295139 -1061.822435 1075.185033 13.362598 1465.309371 -1478.996742 -13.687372
