title: ChemShell job
elementType: c
basis: def2-mSVP
elementType: n
elementType: h
elementType: s
method: uhf
method: dft
functional: pbeh-3c
elementType: c n h s
basis: def2-mSVP def2-mSVP def2-mSVP def2-mSVP
frequency: -0.00 -0.00 -0.00 0.0000 0.0000 0.0000 41.69 65.76 110.05 117.99 188.00 200.67 225.51 233.79 271.32 310.29 337.26 344.86 361.34 362.37 386.06 412.91 466.88 495.88 518.29 528.63 555.58 556.40 562.53 599.28 605.05 612.48 636.31 657.19 681.49 689.83 706.40 723.53 750.54 781.49 788.34 792.72 827.17 846.78 863.77 875.88 890.90 908.34 918.87 939.39 1018.19 1022.17 1031.85 1036.05 1052.22 1086.52 1116.27 1130.39 1159.79 1188.11 1228.78 1249.61 1295.23 1317.32 1339.36 1343.54 1363.77 1379.47 1403.05 1417.20 1427.73 1466.46 1490.68 1498.87 1532.22 1549.00 1553.97 1601.25 1616.02 1630.30 1649.94 1693.77 1712.93 1737.64 1766.61 1823.26 3252.61 3275.94 3281.55 3289.86 3291.22 3305.92 3628.98
irintensity: 0.00000 0.00000 0.00000 0 0 0 1.65001 0.00095 5.15454 1.71715 5.52714 3.43724 0.74310 5.50303 2.49405 2.56026 25.34469 1.57144 2.37898 5.70785 2.26154 16.84092 1.26313 3.98630 34.37767 7.77748 16.12601 2.04378 2.53612 8.68262 8.17999 0.19475 5.37657 28.36700 5.04898 4.57135 86.34995 23.54030 0.23727 1.10779 21.39468 16.73950 69.73658 10.71865 41.49087 4.33425 7.09949 73.68805 36.09966 4.09047 99.11841 0.09600 3.12778 0.05440 0.14024 2.28834 4.43776 63.04059 7.64543 162.79661 327.22324 422.81358 61.48638 88.72222 386.39791 256.55633 314.58079 162.94597 144.25704 28.96810 18.50083 92.18889 56.29115 111.18673 272.93994 447.09843 123.00219 353.54402 45.52160 124.03705 87.32585 139.07624 280.51044 210.81568 302.86636 193.88326 61.70916 0.54634 1.10881 7.12528 9.39067 0.87293 182.54504
energy: -1686.059844254 hartree
zeropoint: 0.21908206096000002 hartree
formula: C19H7N3S2
InChI: InChI=1/C19H7N3S2/c23-19-9-3-4-10-14-13(9)15-12-8(16(14)24-10)2-1-7-5-6-20-17(11(7)12)21-18(15)22-19/h1-6,22H
31 atoms
C  -1.58177109 -2.6260158 -0.44499909
N  -2.64093897 -1.89881261 -0.24937214
C  -0.28636172 -2.0938788 -0.58601301
C  -2.46122944 -0.54698047 -0.18824176
C  -0.04774579 -0.72331214 -0.52804668
C  -1.18584333 0.07339772 -0.3226975
N  -3.55935674 0.18869701 0.00358151
C  -1.06589341 1.47602579 -0.25702047
C  -3.43315047 1.5034681 0.06253558
C  -2.23105712 2.19973333 -0.05943175
C  1.2720439 -0.12718759 -0.67492411
C  1.34999933 1.30489024 -0.59776376
C  0.24520849 2.05967172 -0.40056277
C  0.75774132 -2.97725692 -0.79783044
H  0.33397364 3.13699169 -0.34798886
H  -2.22260223 3.27966943 0.00090063
H  -4.34980048 2.06137941 0.21809039
C  0.67754609 -4.36968582 -0.8986888
N  -1.67203656 -4.00806767 -0.5307002
C  -0.67052161 -4.9214426 -0.74629996
C  3.14426808 -4.39956218 -1.2686813
C  1.8740524 -5.04665345 -1.1318426
H  4.0201737 -5.00545965 -1.45182254
H  1.85446191 -6.12577586 -1.21831939
H  -2.60169689 -4.39758431 -0.42757694
H  2.31679904 1.77945014 -0.70206593
S  -1.01724404 -6.53369391 -0.8202407
S  4.04479578 -1.42787335 -1.16725882
C  2.28597596 -1.03974055 -0.87746433
C  3.16847376 -3.02988421 -1.15751064
C  1.97272177 -2.38951216 -0.92659458
energy: -1686.0598442539335
energyOcCorr: -1686.0599945497
s2: -0.00000000
charge: 0.000000
dipole: 29.087722 -26.588976 2.498746 -617.425253 619.931119 2.505866 -211.605339 211.407586 -0.197753
quadrupole: 3156.970730 -3267.632710 -110.661980 6447.382454 -6565.002030 -117.619576 352.137414 -466.279250 -114.141836 -757.837668 740.219225 -17.618443 -521.579466 517.313028 -4.266438 1136.632545 -1136.736686 -0.104141
temp: 298.15 k
press: 1.0 bar
thermalcorrgfe: 0.176572066482 hartree
thermalcorrener: 0.234084916282 hartree
entropy: 0.51478 kJ.mol-1.K-1
thermalcorrenthalpy: 0.235029498186 hartree
