title: ChemShell job
elementType: c
basis: def2-TZVPD
elementType: n
elementType: h
elementType: s
method: uhf
method: dft
functional: cam-b3lyp
elementType: c n h s
basis: def2-TZVPD def2-TZVPD def2-TZVPD def2-TZVPD
energy: -1688.789228771 hartree
formula: C19H7N3S2
InChI: InChI=1/C19H7N3S2/c23-19-9-3-4-10-14-13(9)15-12-8(16(14)24-10)2-1-7-5-6-20-17(11(7)12)21-18(15)22-19/h1-6,22H
31 atoms
C  -1.58177082 -2.6260157 -0.44499895
N  -2.6409387 -1.89881279 -0.24937197
C  -0.28636197 -2.09387876 -0.58601293
C  -2.46122972 -0.54698094 -0.18824198
C  -0.04774599 -0.72331192 -0.52804694
C  -1.18584287 0.07339799 -0.32269796
N  -3.5593566 0.18869698 0.003582
C  -1.06589388 1.47602583 -0.25702097
C  -3.43315061 1.50346783 0.06253599
C  -2.23105675 2.19973375 -0.059432
C  1.27204385 -0.12718798 -0.67492392
C  1.34999885 1.30488985 -0.59776393
C  0.24520897 2.05967177 -0.40056295
C  0.75774091 -2.97725666 -0.79783091
H  0.33397396 3.13699165 -0.34798896
H  -2.22260175 3.27966963 0.000901
H  -4.34980051 2.06137977 0.21808998
C  0.67754592 -4.36968551 -0.8986889
N  -1.67203681 -4.00806755 -0.53069994
C  -0.67052192 -4.92144244 -0.74629992
C  3.14426765 -4.3995625 -1.26868085
C  1.87405279 -5.04665343 -1.13184287
H  4.02017354 -5.00545944 -1.45182283
H  1.85446179 -6.1257763 -1.21831986
H  -2.6016967 -4.3975845 -0.42757695
H  2.31679874 1.7794498 -0.70206592
S  -1.01724388 -6.53369426 -0.82024091
S  4.04479554 -1.42787384 -1.16725887
C  2.28597574 -1.03974088 -0.8774639
C  3.16847364 -3.02988466 -1.15751087
C  1.97272177 -2.38951173 -0.9265949
energy: -1688.7892287712471
energyOcCorr: -1688.7906622249
s2: 0.00000000
charge: -0.000000
dipole: 29.087705 -26.173228 2.914476 -617.425283 620.170622 2.745339 -211.605356 211.372563 -0.232793
quadrupole: 3156.970438 -3274.402400 -117.431962 6447.382764 -6573.616816 -126.234052 352.137472 -465.781310 -113.643838 -757.837731 738.233778 -19.603954 -521.579482 517.827781 -3.751701 1136.632680 -1137.347437 -0.714758
