title: ChemShell job
elementType: c
basis: def2-TZVPD
elementType: n
elementType: h
elementType: s
elementType: li
method: uhf
method: dft
functional: cam-b3lyp
elementType: c n h s li
basis: def2-TZVPD def2-TZVPD def2-TZVPD def2-TZVPD def2-TZVPD
energy: -2929.224162373 hartree
formula: C19H7Li6N3S5
InChI: InChI=1/C19H7N3S3.6Li.2S/c23-10-4-3-9-13-14(10)16(24)8-2-1-7-5-6-20-17-11(7)12(8)15(13)18(21-17)22-19(9)25;;;;;;;;/h1-6,22H;;;;;;;;/rC19H7Li6N3S5/c29-19-9-3-4-10-14-13(9)15-12-8(2-1-7-5-6-26-17(11(7)12)27-18(15)28-19)16(14)31-21-33-22-32(23-33)20-30(10)24(31,33)25(30,31,32)33/h1-6,28H
40 atoms
C  -1.7681508 -2.19258075 -0.38378296
N  -2.87488167 -1.50509183 -0.17293498
C  -0.47048695 -1.65722281 -0.49065195
C  -2.77260669 -0.16102498 -0.05643899
C  -0.34452296 -0.26034197 -0.39266996
C  -1.51130983 0.50126695 -0.17081198
N  -3.89723056 0.52368994 0.15778298
C  -1.44608083 1.90495279 -0.08247299
C  -3.81275957 1.85735879 0.25549297
C  -2.6567017 2.59244571 0.14536599
C  0.9110059 0.34754996 -0.56662694
C  0.9443829 1.7661908 -0.48172695
C  -0.17544398 2.51360672 -0.23853697
C  0.65398192 -2.48739872 -0.67153992
C  1.97172078 -1.89606379 -0.74451492
C  2.05517177 -0.46698894 -0.8363259
H  -0.09619399 3.59163959 -0.16759198
H  -2.6804357 3.67120259 0.22760098
H  -4.75260246 2.37192173 0.43183995
C  3.07660865 -2.81326668 -0.72642492
C  0.44344195 -3.88666856 -0.77912991
N  -1.88743379 -3.5446516 -0.51278994
C  -0.8749269 -4.4261945 -0.71734292
C  2.82420768 -4.18960453 -0.8848879
C  1.56581683 -4.72489246 -0.93997089
H  3.67397058 -4.86053045 -0.91779289
H  1.42333384 -5.79067935 -1.05479188
S  -1.26377385 -6.06595031 -0.8681519
H  -2.82259468 -3.92716255 -0.45105795
S  4.75766246 -2.43569872 -0.32895096
S  7.43246416 -1.93054278 -3.03879066
H  1.89354379 2.26847974 -0.60568293
S  3.4902626 0.35071096 -1.42639984
S  6.82976123 0.93108489 -0.8705939
Li 7.64763813 0.40804496 -3.05290065
Li 5.48737738 -0.8579719 -2.07651676
Li 4.98576944 2.29355874 -1.18712587
Li 8.02817109 -1.09014387 -0.92115589
Li 5.06521542 -0.14587799 0.33937396
Li 6.2134833 -3.5321026 -1.93795278
energy: -2929.2241623725013
energyOcCorr: -2929.2390686869
s2: 0.81444201
charge: -1.000000
dipole: 717.958789 -711.833123 6.125666 -558.623256 567.499272 8.876017 -358.757256 360.713083 1.955827
quadrupole: 12837.754074 -13015.391496 -177.637422 6344.375845 -6562.095246 -217.719402 1100.987967 -1275.667336 -174.679369 -1649.685176 1648.802928 -0.882248 -2791.828091 2804.005388 12.177297 1206.049336 -1230.909428 -24.860092
