title: ChemShell job
elementType: c
basis: def2-TZVPD
elementType: n
elementType: h
elementType: s
elementType: li
method: uhf
method: dft
functional: cam-b3lyp
elementType: c n h s li
basis: def2-TZVPD def2-TZVPD def2-TZVPD def2-TZVPD def2-TZVPD
energy: -2936.538318578 hartree
formula: C19H7Li7N3S5
InChI: InChI=1/C19H7N3S3.7Li.2S/c23-10-4-3-9-13-14(10)16(24)8-2-1-7-5-6-20-17-11(7)12(8)15(13)18(21-17)22-19(9)25;;;;;;;;;/h1-6,22H;;;;;;;;;/rC19H7Li7N3S5/c20-32-10-4-3-9-13-14(10)16(31-22-34(21)24-33(23-32)25(34)26(31,32,33)34)8-2-1-7-5-6-27-17-11(7)12(8)15(13)18(28-17)29-19(9)30/h1-6,29H
41 atoms
C  -1.7835508 -2.25967174 -0.56522393
N  -2.86371667 -1.55552983 -0.37444896
C  -0.46047295 -1.7568198 -0.56687393
C  -2.72101969 -0.22315197 -0.17816398
C  -0.29310596 -0.38996696 -0.37675096
C  -1.44691683 0.39708695 -0.18535798
N  -3.83957756 0.48067194 0.014245
C  -1.34811085 1.7910638 -0.017757
C  -3.72644758 1.7889808 0.19143298
C  -2.53077571 2.49576971 0.18123698
C  0.99317889 0.19204198 -0.44361095
C  1.05619988 1.61914282 -0.29945397
C  -0.04322499 2.37821473 -0.07691199
C  0.64702692 -2.6058697 -0.72724692
C  1.96973978 -2.06328477 -0.66800292
C  2.11897576 -0.62401993 -0.67690693
H  0.05530799 3.44911461 0.049542
H  -2.53000171 3.5684216 0.32196097
H  -4.65557947 2.32690273 0.34892696
C  3.03982166 -3.01290366 -0.59547293
C  0.39978495 -3.98698455 -0.92805089
N  -1.94577078 -3.60358059 -0.77675891
C  -0.95905589 -4.50257049 -0.97264989
C  2.76233268 -4.35211251 -0.8730169
C  1.48340083 -4.83477245 -1.06533088
H  3.5814206 -5.06080843 -0.8873029
H  1.32532185 -5.88561033 -1.26490985
S  -1.35786385 -6.09915531 -1.23322886
H  -2.89795767 -3.94815755 -0.78649891
S  4.66996547 -2.71999769 0.005605
S  6.44143727 -1.66844081 -3.28915663
H  2.02018977 2.10249476 -0.35914396
S  3.59944259 0.15219698 -1.12644587
S  6.68615824 1.46639283 -1.46680783
Li 5.2547564 0.37092796 -3.18093664
Li 5.82037834 -0.8560839 -1.05325288
Li 7.68564213 3.47428961 -1.87569178
Li 7.99670109 -0.09587399 -2.6357147
Li 4.90037945 1.89632878 -0.07311399
Li 4.79880946 -4.32252251 1.7618918
Li 5.64092136 -3.43395361 -2.14409876
energy: -2936.5383185784790
energyOcCorr: -2936.5423292861
s2: -0.00000000
charge: 1.000000
dipole: 714.734252 -695.441297 19.292955 -579.579999 582.844674 3.264675 -387.326248 389.787015 2.460767
quadrupole: 12120.218180 -12089.009139 31.209041 6873.354164 -6960.019989 -86.665825 1389.666232 -1542.780373 -153.114141 -1111.480379 1112.414255 0.933875 -2706.838124 2709.320857 2.482733 1212.655239 -1263.448883 -50.793643
