title: ChemShell job
elementType: c
basis: def2-TZVPD
elementType: n
elementType: h
elementType: s
elementType: li
method: uhf
method: dft
functional: cam-b3lyp
elementType: c n h s li
basis: def2-TZVPD def2-TZVPD def2-TZVPD def2-TZVPD def2-TZVPD
energy: -2936.660447150 hartree
formula: C19H7Li7N3S5
InChI: InChI=1/C19H7N3S3.7Li.2S/c23-10-4-3-9-13-14(10)16(24)8-2-1-7-5-6-20-17-11(7)12(8)15(13)18(21-17)22-19(9)25;;;;;;;;;/h1-6,22H;;;;;;;;;/rC19H7Li7N3S5/c20-31-10-4-3-9-13-14(10)16(32-23-34(21)24-33(22-31)25(32,34)26(31,32,33)34)8-2-1-7-5-6-27-17-11(7)12(8)15(13)18(28-17)29-19(9)30/h1-6,29H
41 atoms
C  -1.7786698 -2.25705774 -0.56272694
N  -2.87350668 -1.54728682 -0.37559296
C  -0.46071295 -1.7596468 -0.56264594
C  -2.73617669 -0.21687498 -0.17591498
C  -0.29658296 -0.37668896 -0.37981696
C  -1.45253584 0.40908495 -0.18391998
N  -3.85037356 0.48958495 0.017665
C  -1.35343685 1.80275279 -0.015994
C  -3.73378258 1.8111438 0.19546298
C  -2.55255471 2.51493472 0.18590598
C  0.98510989 0.19690498 -0.44844595
C  1.04965488 1.60997282 -0.29642097
C  -0.05886599 2.37892073 -0.07496599
C  0.64506693 -2.6154537 -0.72173692
C  1.97956977 -2.06522177 -0.66710792
C  2.12188076 -0.64212593 -0.68112192
H  0.04787799 3.44971861 0.050055
H  -2.54860071 3.58784359 0.32672296
H  -4.66667247 2.34399573 0.35258996
C  3.04765565 -3.02302066 -0.60674993
C  0.40067695 -3.99884355 -0.92808589
N  -1.93077578 -3.59373159 -0.77618691
C  -0.9346489 -4.49646949 -0.97256789
C  2.77152969 -4.3734775 -0.8881079
C  1.50455683 -4.86249845 -1.07504788
H  3.59999959 -5.07299343 -0.9137159
H  1.34023585 -5.91082833 -1.28042785
S  -1.36604585 -6.11083331 -1.23385786
H  -2.87877767 -3.94712555 -0.78820291
S  4.68444947 -2.72430669 0.01828
S  6.44741027 -1.66964581 -3.29542163
H  2.01386877 2.09393376 -0.35438096
S  3.61142959 0.16027398 -1.13472787
S  6.69671624 1.47165683 -1.46782583
Li 5.22481741 0.35749896 -3.14404064
Li 5.78212035 -0.8635449 -1.04968388
Li 7.68637913 3.4750126 -1.87560679
Li 7.9860201 -0.09713199 -2.6325187
Li 4.88549045 1.86314479 -0.08668499
Li 4.78766346 -4.30814351 1.7447848
Li 5.61245436 -3.40735362 -2.11631776
energy: -2936.6604471504502
energyOcCorr: -2936.6712966064
s2: 0.81379229
charge: -0.000000
dipole: 714.864658 -696.687439 18.177219 -579.588136 586.704978 7.116842 -387.400195 391.211278 3.811084
quadrupole: 12142.124247 -12153.341407 -11.217159 6897.206331 -7036.713552 -139.507221 1390.253261 -1553.171638 -162.918377 -1129.298101 1135.075828 5.777727 -2710.644312 2717.969641 7.325329 1217.198518 -1276.363276 -59.164758
