title: ChemShell job
elementType: c
basis: def2-mSVP
elementType: n
elementType: h
elementType: s
elementType: li
method: uhf
method: dft
functional: pbeh-3c
elementType: c n h s li
basis: def2-mSVP def2-mSVP def2-mSVP def2-mSVP def2-mSVP
frequency: -36.28 -0.00 -0.00 -0.00 0.0000 0.0000 0.0000 25.35 33.23 43.29 58.32 65.33 66.30 69.19 75.47 87.13 94.73 97.30 137.04 148.83 157.33 168.45 181.89 195.74 201.47 207.95 209.90 217.07 243.33 245.53 255.08 269.76 287.24 318.05 328.50 337.03 343.54 348.52 354.44 360.90 364.29 376.56 384.13 397.08 411.02 414.45 424.02 438.76 454.14 460.99 480.21 486.06 514.88 526.49 538.11 544.27 547.78 566.98 574.59 605.26 612.55 629.04 659.95 666.89 686.72 700.74 709.77 735.18 754.08 775.22 778.77 790.61 830.36 832.59 850.00 858.74 887.14 901.22 903.15 944.68 987.41 997.22 1022.91 1034.26 1059.68 1083.10 1144.60 1159.82 1170.88 1188.98 1210.28 1243.66 1261.06 1290.50 1318.96 1330.39 1339.12 1345.90 1349.90 1377.32 1414.60 1439.90 1452.78 1469.61 1484.75 1491.60 1516.95 1561.59 1575.19 1592.41 1613.49 1631.13 1639.75 1673.39 1696.35 1714.89 3245.74 3266.69 3267.80 3290.28 3291.87 3296.25 3636.40
irintensity: 0.00000 0.00000 0.00000 0.00000 0 0 0 4.55869 7.28438 3.41452 8.42294 42.71917 5.42725 6.67345 57.10752 9.51603 34.61772 71.22244 70.13730 37.81737 161.56861 18.14386 7.87751 58.93150 30.36870 19.22981 13.95983 35.96582 14.55077 32.34864 135.13851 71.95474 38.50790 16.17381 31.07916 84.84899 178.43061 28.71548 124.83757 61.37970 246.60248 3.51414 28.61930 117.56931 105.56617 119.01287 42.84128 161.97974 229.30580 2.56224 215.58620 172.06252 16.68695 140.74731 8.38088 35.13957 22.64294 52.32686 144.21349 12.77657 39.19349 21.88683 21.09914 52.81073 98.24369 12.26627 72.76287 64.11923 174.28248 54.55396 15.92783 101.03100 12.78151 37.79338 66.40231 8.50084 75.52429 11.00281 32.44856 24.56377 228.98220 9.21031 0.35671 1.09975 35.59927 192.37134 622.84885 43.90174 148.59930 17.50186 215.77390 432.55127 912.10013 52.12661 130.70198 20.20227 1338.09309 247.94177 404.39460 188.61623 212.63270 234.69278 185.15286 802.85665 21.61556 68.15204 95.62266 72.74379 451.46220 61.68748 39.41333 318.08328 624.31901 186.97775 519.39305 1121.67925 19.37958 28.63646 15.50997 18.36839 6.04198 2.45189 146.37330
energy: -2932.454329170 hartree
zeropoint: 0.23359358133999997 hartree
formula: C19H7Li7N3S5
InChI: InChI=1/C19H7N3S3.7Li.2S/c23-10-4-3-9-13-14(10)16(24)8-2-1-7-5-6-20-17-11(7)12(8)15(13)18(21-17)22-19(9)25;;;;;;;;;/h1-6,22H;;;;;;;;;/q-1;;;;;;;+1;;/rC19H7Li7N3S5/c20-33-25-26(33)28-6-5-7-1-2-8-12-11(7)19(28)29(21-34(25,26)22-29)17-15(12)13-9(18(30)27-17)3-4-10-14(13)16(8)32-23-31(10)24-32/h1-6,27H
41 atoms
C  -1.28284795 -2.41848242 -0.79253121
N  -2.44154272 -1.7471344 -0.65212103
C  -0.0160648 -1.84483439 -0.73287112
C  -2.37099853 -0.39682146 -0.48443444
C  0.06985769 -0.45205285 -0.53253544
C  -1.12610357 0.28457907 -0.42551795
N  -3.5294938 0.25885967 -0.39165566
C  -1.10441138 1.67762161 -0.23255117
C  -3.49381341 1.60711432 -0.23810787
C  -2.35024213 2.34308343 -0.14938129
C  1.31950505 0.16615878 -0.39152336
C  1.31327295 1.57175322 -0.18649248
C  0.15674068 2.30311344 -0.12807179
C  1.14917687 -2.6354803 -0.8725424
C  2.44406172 -2.00652067 -0.8300571
C  2.51389132 -0.62821993 -0.42732005
H  0.20641457 3.37559882 0.0128184
H  -2.39977483 3.41428881 -0.0108954
H  -4.4618347 2.09035766 -0.16566928
C  3.5600086 -2.83617268 -1.18172186
C  0.99478369 -4.03325704 -1.02850498
N  -1.36177375 -3.75900397 -0.97990439
C  -0.30887516 -4.61947268 -1.06027018
C  3.37571432 -4.23117512 -1.24040766
C  2.14958286 -4.83136815 -1.14567017
H  4.24841052 -4.84673335 -1.41765084
H  2.05167746 -5.90556093 -1.21291536
S  -0.63908923 -6.26435129 -1.18409857
H  -2.27929034 -4.17827703 -1.06026838
S  5.14833302 -2.29633374 -1.7284964
S  -5.89392263 -2.50099922 -0.64667673
H  2.26052874 2.08167866 -0.07998129
S  3.95519325 0.14203899 0.22280667
S  -7.28440318 0.8624687 0.76626811
Li -7.78365562 -1.22743866 -0.10143809
Li -5.42556958 -0.30672776 0.15475748
Li -7.68112553 2.23790845 -0.94233439
Li -4.17096913 -1.59173092 -1.88726019
Li 5.53938927 -1.60466432 0.49886755
Li 4.93597694 0.05457909 -1.93212858
Li -3.94184855 -2.70203179 0.52890834
energy: -2932.4543291702071
energyOcCorr: -2932.4578622080
s2: 0.81850853
charge: 0.000000
dipole: -265.978556 268.832221 2.853665 -648.020122 654.610357 6.590235 -269.755562 267.354729 -2.400833
quadrupole: 12295.714996 -12398.287078 -102.572082 6677.257578 -6882.631135 -205.373557 679.763639 -832.287377 -152.523737 -962.480497 937.226909 -25.253588 -626.815704 671.427995 44.612291 1576.205197 -1612.768603 -36.563406
temp: 298.15 k
press: 1.0 bar
thermalcorrgfe: 0.17294989958399998 hartree
thermalcorrener: 0.263580247994 hartree
entropy: 0.80640 kJ.mol-1.K-1
thermalcorrenthalpy: 0.26452482989799997 hartree
