title: ChemShell job
elementType: c
basis: def2-mSVP
elementType: n
elementType: h
elementType: s
elementType: li
method: uhf
method: dft
functional: pbeh-3c
elementType: c n h s li
basis: def2-mSVP def2-mSVP def2-mSVP def2-mSVP def2-mSVP
frequency: -0.00 -0.00 -0.00 -0.00 -0.00 0.0000 31.38 50.87 64.86 79.71 98.05 107.12 153.55 174.74 183.82 196.66 200.64 221.22 242.07 248.86 266.46 291.55 319.95 327.02 333.24 343.77 365.51 370.60 372.60 383.78 398.11 408.00 425.33 442.09 461.73 513.17 533.40 539.56 544.65 559.52 567.62 606.09 615.50 625.25 657.60 664.13 686.64 702.10 709.47 732.29 751.90 774.57 778.18 790.10 828.59 832.60 847.16 857.84 883.74 893.28 901.91 944.89 983.51 998.14 1019.31 1032.86 1054.78 1086.20 1144.22 1163.66 1170.39 1187.66 1208.28 1239.84 1260.39 1285.08 1321.14 1328.36 1332.94 1334.18 1347.47 1377.71 1412.03 1440.96 1448.49 1470.50 1489.40 1493.04 1530.12 1558.28 1574.17 1592.16 1611.35 1625.66 1636.90 1676.66 1692.99 1713.17 3258.87 3264.25 3265.14 3285.90 3291.31 3293.87 3637.59
irintensity: 0.00000 0.00000 0.00000 0.00000 0.00000 0 3.43289 22.81500 0.93588 9.94930 9.82819 93.79630 165.16853 5.09273 18.01897 52.39951 6.58657 1.20712 57.26744 32.59524 0.49992 10.37220 10.39002 8.65699 42.42340 20.77733 22.20761 116.72119 124.41133 14.28943 172.82392 164.98243 53.19268 122.18290 2.32258 21.69999 101.18921 11.98659 24.47837 42.24238 11.28959 15.42451 36.80320 14.15655 24.15124 40.46353 92.87974 4.44795 95.17096 72.95615 176.44834 25.73881 40.03157 90.59786 1.99178 44.96144 50.84598 7.63266 53.58811 58.13491 4.36184 34.35552 249.15091 3.22517 0.17323 0.93937 36.22670 206.15320 693.51962 4.82872 282.36697 26.90756 278.71672 812.84832 986.69259 35.34937 138.36220 43.78684 73.15382 1888.40839 321.46848 75.02069 122.42466 291.34599 310.23178 849.64763 147.03299 22.16287 96.69985 74.93422 460.41238 48.05070 34.35472 459.03408 539.61495 188.58823 435.33561 1368.14952 49.28524 28.64950 24.58181 35.85066 6.52841 2.95330 175.84188
energy: -2106.637013503 hartree
zeropoint: 0.22369070653999998 hartree
formula: C19H7Li3N3S3
InChI: InChI=1/C19H7N3S3.3Li/c23-10-4-3-9-13-14(10)16(24)8-2-1-7-5-6-20-17-11(7)12(8)15(13)18(21-17)22-19(9)25;;;/h1-6,22H;;;/q-2;;;+2/rC19H7Li3N3S3/c26-18-9-3-4-10-14-13(9)15-12-8(16(14)28-21-27(10)22-28)2-1-7-5-6-24-19(11(7)12)25(20-24)17(15)23-18/h1-6,23H
35 atoms
C  -1.27818595 -2.21735905 -0.55998313
N  -2.38557353 -1.49650263 -0.41434815
C  0.018369 -1.68686341 -0.62312113
C  -2.25869175 -0.15414618 -0.31922346
C  0.16217988 -0.29067937 -0.50040794
C  -0.99834289 0.49277995 -0.34874556
N  -3.40186091 0.51986384 -0.17686018
C  -0.93792609 1.89036149 -0.20356827
C  -3.33485632 1.86032019 -0.05821239
C  -2.16853016 2.57965361 -0.0626665
C  1.43850544 0.29304787 -0.48558165
C  1.47762323 1.70674241 -0.32976546
C  0.34874066 2.47585492 -0.20431988
C  1.14080287 -2.52180711 -0.81889561
C  2.46223112 -1.93806268 -0.9046876
C  2.60348141 -0.53816304 -0.59771503
H  0.44236295 3.5499796 -0.10136429
H  -2.19330325 3.65569168 0.0459462
H  -4.28495071 2.36935423 0.05150019
C  3.5202231 -2.83156638 -1.28538325
C  0.9170504 -3.91694936 -0.92553629
N  -1.41406774 -3.56417619 -0.65415712
C  -0.40323075 -4.4554278 -0.82237911
C  3.26307433 -4.21628092 -1.32990645
C  2.02339937 -4.76137946 -1.14150127
H  4.09300553 -4.87141105 -1.56235792
H  1.87559869 -5.83067344 -1.19707316
S  -0.79339961 -6.09447561 -0.902666
H  -2.35096053 -3.94313145 -0.59624053
S  5.13950572 -2.41209023 -1.85583129
H  2.44299582 2.19292275 -0.31554137
S  4.12548703 0.25399767 -0.19091768
Li 5.05262303 -0.10786529 -2.32853654
Li 5.62530366 -1.51171733 0.26891997
Li -4.3916574 -1.26304475 -0.09842359
energy: -2106.6370135025691
energyOcCorr: -2106.6385144204
s2: 0.81473694
charge: 0.000000
dipole: 287.227209 -287.826308 -0.599099 -538.064752 542.555261 4.490509 -255.466600 256.193384 0.726784
quadrupole: 5538.972135 -5573.465959 -34.493824 5950.142200 -6133.935082 -183.792882 543.809699 -670.997826 -127.188127 -1456.373433 1469.228708 12.855274 -952.402479 948.505373 -3.897106 1265.371122 -1285.005224 -19.634102
temp: 298.15 k
press: 1.0 bar
thermalcorrgfe: 0.174587682724 hartree
thermalcorrener: 0.24469622751 hartree
entropy: 0.62569 kJ.mol-1.K-1
thermalcorrenthalpy: 0.24563700061599997 hartree
