title: ChemShell job
elementType: c
basis: def2-TZVPD
elementType: n
elementType: h
elementType: s
elementType: li
method: uhf
method: dft
functional: cam-b3lyp
elementType: c n h s li
basis: def2-TZVPD def2-TZVPD def2-TZVPD def2-TZVPD def2-TZVPD
energy: -2109.857267501 hartree
formula: C19H7Li3N3S3
InChI: InChI=1/C19H7N3S3.3Li/c23-10-4-3-9-13-14(10)16(24)8-2-1-7-5-6-20-17-11(7)12(8)15(13)18(21-17)22-19(9)25;;;/h1-6,22H;;;/q-2;;;+2/rC19H7Li3N3S3/c26-18-9-3-4-10-14-13(9)15-12-8(16(14)28-21-27(10)22-28)2-1-7-5-6-24-19(11(7)12)25(20-24)17(15)23-18/h1-6,23H
35 atoms
C  -1.27818586 -2.21735875 -0.55998294
N  -2.38557373 -1.49650283 -0.41434795
C  0.018369 -1.68686381 -0.62312093
C  -2.25869175 -0.15414598 -0.31922296
C  0.16217998 -0.29067897 -0.50040794
C  -0.99834289 0.49277995 -0.34874596
N  -3.40186062 0.51986394 -0.17685998
C  -0.93792589 1.89036179 -0.20356798
C  -3.33485662 1.86031979 -0.05821199
C  -2.16852975 2.57965371 -0.06266599
C  1.43850583 0.29304797 -0.48558194
C  1.47762283 1.7067428 -0.32976496
C  0.34874096 2.47585472 -0.20431998
C  1.14080287 -2.52180672 -0.81889591
C  2.46223072 -1.93806278 -0.9046879
C  2.6034817 -0.53816294 -0.59771493
H  0.44236295 3.5499796 -0.10136399
H  -2.19330375 3.65569159 0.04594599
H  -4.28495052 2.36935373 0.05149999
C  3.5202236 -2.83156668 -1.28538286
C  0.9170499 -3.91694955 -0.9255359
N  -1.41406784 -3.5641766 -0.65415693
C  -0.40323095 -4.4554275 -0.8223789
C  3.26307463 -4.21628052 -1.32990685
C  2.02339977 -4.76137946 -1.14150087
H  4.09300553 -4.87141145 -1.56235782
H  1.87559879 -5.83067334 -1.19707287
S  -0.79339991 -6.09447531 -0.9026659
H  -2.35096074 -3.94313155 -0.59624093
S  5.13950542 -2.41209073 -1.85583079
H  2.44299572 2.19292275 -0.31554096
S  4.12548753 0.25399797 -0.19091798
Li 5.05262343 -0.10786499 -2.32853674
Li 5.62530336 -1.51171683 0.26891997
Li -4.3916575 -1.26304485 -0.09842399
energy: -2109.8572675006440
energyOcCorr: -2109.8623310858
s2: 0.81681871
charge: 0.000000
dipole: 287.227218 -287.749326 -0.522107 -538.064738 543.219013 5.154275 -255.466560 256.243665 0.777105
quadrupole: 5538.972346 -5581.333328 -42.360982 5950.142123 -6149.861682 -199.719559 543.809547 -672.514651 -128.705104 -1456.373259 1468.459035 12.085776 -952.402472 949.285396 -3.117076 1265.371007 -1287.530231 -22.159224
