title: ChemShell job
elementType: c
basis: def2-TZVPD
elementType: h
elementType: s
method: uhf
method: dft
functional: cam-b3lyp
elementType: c h s
basis: def2-TZVPD def2-TZVPD def2-TZVPD
energy: -2207.349087155 hartree
formula: C16H8S4
InChI: InChI=1/C16H8S4/c1-2-9-4-5-10-6-7-12-16-13(18-20-19-17-12)8-11(3-1)14(9)15(10)16/h1-8H
28 atoms
C  -1.90694278 -2.6472077 -0.21204298
C  -2.98028666 -1.83296279 -0.29379796
C  -0.59116993 -2.12475076 -0.000385
H  -3.97024355 -2.24243875 -0.45317695
C  -2.83102268 -0.41662795 -0.17143598
C  -0.39638195 -0.72324092 0.11800498
C  -1.53809782 0.12531399 0.031585
H  -2.02326677 -3.71991558 -0.30453497
C  -3.92896155 0.44140395 -0.25054597
C  -1.39510784 1.52451183 0.14350698
C  -3.77212757 1.81361379 -0.13582698
C  -2.51263172 2.35542874 0.058329
C  0.9112349 -0.18506798 0.32356696
C  1.01261489 1.25991086 0.38601596
C  -0.08489599 2.05381477 0.30938796
C  0.50230094 -2.98083266 0.08881599
C  1.7638118 -2.47055972 0.30281297
C  1.97766277 -1.10154088 0.42366295
H  0.35938396 -4.04960654 -0.003646
H  2.6071387 -3.14357064 0.38305796
H  0.02990999 3.13021165 0.35403896
H  -2.38618273 3.42782061 0.14160099
H  -4.91507444 0.021629 -0.40501196
H  -4.63511147 2.46257672 -0.20114298
S  2.54654471 2.13946975 0.59285193
S  3.64444959 -0.63363093 0.82957891
S  4.4412635 -0.06773599 -0.92691189
S  3.44579161 1.91171378 -1.18649087
energy: -2207.3490871547820
energyOcCorr: -2207.3492958073
s2: -0.00000000
charge: 0.000000
dipole: 218.632588 -221.191276 -2.558688 37.853141 -38.553029 -0.699888 -9.097981 9.288604 0.190623
quadrupole: 4723.712029 -4831.211066 -107.499037 1803.125996 -1896.344093 -93.218097 211.250870 -321.471078 -110.220208 263.886624 -268.719623 -4.832999 -83.441855 85.693138 2.251283 -61.852352 62.858793 1.006441
