title: ChemShell job
elementType: c
basis: def2-TZVPD
elementType: h
elementType: s
elementType: li
method: uhf
method: dft
functional: cam-b3lyp
elementType: c h s li
basis: def2-TZVPD def2-TZVPD def2-TZVPD def2-TZVPD
energy: -1426.083479102 hartree
formula: C16H8Li2S2
InChI: InChI=1/C16H8S2.2Li/c17-12-7-6-10-5-4-9-2-1-3-11-8-13(18)16(12)15(10)14(9)11;;/h1-8H;;/q-1;;+1/rC16H8Li2S2/c17-20-13-7-6-10-5-4-9-2-1-3-11-8-12(19-18-20)16(13)15(10)14(9)11/h1-8H
28 atoms
C  -1.90539679 -2.68901269 0.40284196
C  -3.04726065 -1.98856577 0.22965398
C  -0.62523193 -2.05756877 0.34729196
H  -4.01033655 -2.48474772 0.25778197
C  -2.99953466 -0.57857393 0.002404
C  -0.52512494 -0.65605593 0.14864298
C  -1.7386578 0.07233899 -0.016178
H  -1.93995878 -3.75909157 0.57295493
C  -4.16330053 0.16710698 -0.20155798
C  -1.68222081 1.46936883 -0.22079998
C  -4.09240054 1.53551183 -0.41589395
C  -2.86896868 2.18381375 -0.42118195
C  0.75153792 -0.005212 0.08124399
C  0.76109591 1.46028183 0.09463999
C  -0.42338195 2.11556776 -0.12783699
C  0.54049894 -2.80775568 0.47252195
C  1.7615828 -2.20816475 0.27923897
C  1.89529579 -0.8395029 0.000873
H  0.48066995 -3.87055556 0.67541293
H  2.6564337 -2.81701568 0.32178596
H  -0.41495195 3.19937664 -0.14288798
H  -2.82300768 3.25636463 -0.57213294
H  -5.12279942 -0.33489296 -0.19219698
H  -5.00114244 2.10177476 -0.57302593
S  2.11011776 2.47516072 0.55827594
S  3.4835336 -0.34568796 -0.58588194
Li 4.06854254 1.34168885 0.8519369
Li 4.19917752 -2.13735776 -1.91634378
energy: -1426.0834791024179
energyOcCorr: -1426.0879722036
s2: -0.00000000
charge: -0.000000
dipole: -22.756693 27.959027 5.202334 -3.746884 -1.357546 -5.104430 1.224919 -3.155990 -1.931071
quadrupole: 3316.891887 -3349.374619 -32.482731 1646.558042 -1731.521290 -84.963249 114.724924 -201.520180 -86.795256 -21.892011 -2.927384 -24.819394 -11.062273 -2.182316 -13.244590 -24.267962 35.018390 10.750428
