title: ChemShell job
elementType: c
basis: def2-mSVP
elementType: h
elementType: s
elementType: li
method: uhf
method: dft
functional: pbeh-3c
elementType: c h s li
basis: def2-mSVP def2-mSVP def2-mSVP def2-mSVP
energy: -1026.065858909 hartree
zeropoint: 0.19280135476 hartree
formula: C16H8Li2S
InChI: InChI=1/C16H8S.2Li/c17-14-9-7-12-5-4-10-2-1-3-11-6-8-13(14)16(12)15(10)11;;/h1-7,9H;;/rC16H8Li2S/c1-2-9-4-5-10-6-7-12-15-14(10)13(9)11(3-1)8-16(15)17-18(16)19(12)17/h1-8H
27 atoms
C  -1.15345038 -2.75764178 0.17526202
C  -2.38748925 -2.20757354 0.09593806
C  0.02493003 -1.94599398 0.1548914
H  -3.27034894 -2.83534747 0.11343539
C  -2.55493883 -0.78838218 -0.01368428
C  -0.10249584 -0.53730596 0.0475166
C  -1.40075918 0.03724857 -0.03709548
H  -1.03987905 -3.83252603 0.25681592
C  -3.81696476 -0.19684619 -0.09848586
C  -1.53863529 1.44230383 -0.14777886
C  -3.94475657 1.18116985 -0.20706521
C  -2.82152546 1.99307986 -0.23181656
C  1.04036063 0.30890905 0.02360208
C  0.92196024 1.75134794 -0.10696736
C  -0.34989278 2.24552104 -0.18316525
C  1.30546383 -2.49449504 0.23791576
C  2.42509565 -1.68352674 0.22006679
C  2.32347144 -0.29280625 0.11680922
H  1.42262872 -3.56935484 0.31848128
H  3.40826626 -2.13262543 0.28650034
H  -0.51014798 3.31777761 -0.28668166
H  -2.93101382 3.06782012 -0.31870136
H  -4.70060094 -0.82394204 -0.07973441
H  -4.93015026 1.62443034 -0.27321224
S  3.80632291 0.67315502 0.08386055
Li 2.52256246 1.91856845 -1.53683411
Li 2.58076117 2.54273119 0.98156708
energy: -1026.0658589093857
energyOcCorr: -1026.0668037640
s2: -0.00000000
charge: 0.000000
dipole: -16.096444 16.971000 0.874556 -8.880464 11.868885 2.988421 -0.059471 -0.713079 -0.772550
quadrupole: 2777.303331 -2857.801013 -80.497682 1262.390874 -1317.094983 -54.704109 45.624999 -123.494302 -77.869303 43.186854 -25.303956 17.882897 77.412770 -81.013870 -3.601100 -95.813675 93.854379 -1.959297
temp: 298.15 k
press: 1.0 bar
thermalcorrgfe: 0.153007033256 hartree
thermalcorrener: 0.20644827799399998 hartree
entropy: 0.47891 kJ.mol-1.K-1
thermalcorrenthalpy: 0.207392859898 hartree
