title: ChemShell job
elementType: c
basis: def2-mSVP
elementType: h
elementType: li
method: uhf
method: dft
functional: pbeh-3c
elementType: c h li
basis: def2-mSVP def2-mSVP def2-mSVP
energy: -628.2080225516 hartree
zeropoint: 0.18842123706 hartree
formula: C16H8Li2
InChI: InChI=1/C16H8.2Li/c1-3-11-7-9-13-5-2-6-14-10-8-12(4-1)15(11)16(13)14;;/h1-5,7-9H;;/rC16H8Li2/c17-12-7-6-10-5-4-9-2-1-3-11-8-13(18)16(12)15(10)14(9)11/h1-8H
26 atoms
C  -1.99116743 -2.67932574 0.00006515
C  -3.08126687 -1.8780269 0.00015622
C  -0.66496547 -2.13929977 -0.00030969
H  -4.07816082 -2.30367799 0.00033503
C  -2.9409812 -0.45246134 -0.00000607
C  -0.48081485 -0.73063625 -0.00019997
C  -1.63460122 0.10492617 -0.00015078
H  -2.10926587 -3.75747894 0.00020965
C  -4.05113607 0.39524715 0.00008174
C  -1.46965735 1.51176389 -0.00008919
C  -3.87982971 1.77246611 0.00001518
C  -2.60855506 2.32597614 -0.00005066
C  0.83661713 -0.16823885 -0.00000196
C  1.01119115 1.28170135 0.00018038
C  -0.13477872 2.03751722 0.00013406
C  0.46090656 -2.96093963 -0.00055802
C  1.72922146 -2.39689939 -0.00028047
C  1.98125644 -1.01204603 0.00012817
H  0.33079553 -4.03931055 -0.00074164
H  2.56934844 -3.09056839 -0.00029258
H  -0.07388965 3.12814912 0.00031019
H  -2.4881756 3.40389477 0.0000087
H  -5.04796707 -0.02996884 0.00026094
H  -4.74798721 2.42015421 0.00003656
Li 2.68398537 2.46924586 -0.00111674
Li 3.94234365 -0.43694013 0.00269262
energy: -628.2080225516326
energyOcCorr: -628.2098319263
s2: -0.00000000
charge: 0.000000
dipole: -183.828251 190.555737 6.727485 -53.104244 55.628592 2.524348 -0.000871 0.003212 0.002341
quadrupole: 2138.210785 -2156.806937 -18.596153 1363.055381 -1418.528173 -55.472792 0.000109 -78.894335 -78.894226 -190.556582 206.881714 16.325132 0.055460 -0.033399 0.022061 0.030785 -0.045507 -0.014722
temp: 298.15 k
press: 1.0 bar
thermalcorrgfe: 0.14770518644 hartree
thermalcorrener: 0.20155397256399998 hartree
entropy: 0.48251 kJ.mol-1.K-1
thermalcorrenthalpy: 0.20249855446799997 hartree
