title: ChemShell job
elementType: c
basis: def2-TZVPD
elementType: h
elementType: s
elementType: li
method: uhf
method: dft
functional: cam-b3lyp
elementType: c h s li
basis: def2-TZVPD def2-TZVPD def2-TZVPD def2-TZVPD
energy: -1824.325140640 hartree
formula: C16H8Li2S3
InChI: InChI=1/C16H8S3.2Li/c17-12-7-6-10-5-4-9-2-1-3-11-8-13(19-18)16(12)15(10)14(9)11;;/h1-8H;;/rC16H8Li2S3/c1-2-9-4-5-10-6-7-12-16-13(20-18-19(12)17-21(18)20)8-11(3-1)14(9)15(10)16/h1-8H
29 atoms
C  -3.02363666 -2.36974473 -0.07718599
C  -3.90017156 -1.34156685 -0.031458
C  -1.61304682 -2.14472376 -0.09222199
H  -4.96642843 -1.52586782 -0.001391
C  -3.43260261 0.009736 -0.011328
C  -1.10667787 -0.82190891 -0.10927899
C  -2.03767477 0.25653097 -0.07409299
H  -3.37832562 -3.39292962 -0.08329099
C  -4.31387851 1.09157587 0.07425899
C  -1.57685282 1.59252682 -0.08606099
C  -3.84439857 2.39562973 0.08995399
C  -2.48420172 2.6486647 0.001871
C  0.30371696 -0.57664793 -0.11492599
C  0.71424792 0.79624191 -0.34788396
C  -0.18609198 1.81207879 -0.29848296
C  -0.71016492 -3.20637864 -0.05522599
C  0.63634393 -2.96464266 0.08176699
C  1.16933187 -1.66900881 0.11999799
H  -1.07725888 -4.22494352 -0.07180199
H  1.31378885 -3.79805057 0.21216898
H  0.14459198 2.82367468 -0.49950995
H  -2.11749376 3.66773458 -0.011119
H  -5.37878839 0.8994969 0.13041298
H  -4.54284848 3.21967763 0.16003798
S  2.26850874 1.25838186 -1.08113288
S  2.83607268 -1.56932082 0.66291092
S  3.5414786 2.00526377 0.41078996
Li 4.20359053 -0.11125099 -0.58794893
Li 2.82799168 0.39570996 2.01891077
energy: -1824.3251406402208
energyOcCorr: -1824.3274302154
s2: -0.00000000
charge: -0.000000
dipole: -24.577040 25.030451 0.453411 -2.491527 2.199814 -0.291713 -2.971219 4.139489 1.168270
quadrupole: 3986.022749 -4065.472960 -79.450211 1929.694576 -2037.293428 -107.598853 156.613103 -253.173550 -96.560448 114.270711 -119.752114 -5.481403 88.218213 -85.540825 2.677387 -92.245231 96.529352 4.284120
