title: ChemShell job
elementType: c
basis: def2-mSVP
elementType: h
elementType: s
elementType: li
method: uhf
method: dft
functional: pbeh-3c
elementType: c h s li
basis: def2-mSVP def2-mSVP def2-mSVP def2-mSVP
energy: -2219.379041799 hartree
zeropoint: 0.19939057529999998 hartree
formula: C16H8Li2S4
InChI: InChI=1/C16H8S4.2Li/c17-19-12-7-6-10-5-4-9-2-1-3-11-8-13(20-18)16(12)15(10)14(9)11;;/h1-8H;;/rC16H8Li2S4/c1-2-9-4-5-10-6-7-12-16-13(20-22-17-21(18-22)19-12)8-11(3-1)14(9)15(10)16/h1-8H
30 atoms
C  -2.66623711 -2.69467562 -0.54038884
C  -3.78903601 -1.9445239 -0.49447412
C  -1.38211488 -2.13291637 -0.25353284
H  -4.75696098 -2.38623437 -0.69589565
C  -3.71645062 -0.55427749 -0.17496394
C  -1.26137209 -0.75360114 0.04496007
C  -2.44945126 0.03055639 0.07227441
H  -2.72149251 -3.74966063 -0.77892537
C  -4.86285425 0.24085184 -0.10081886
C  -2.37498532 1.40970491 0.35998973
C  -4.77539125 1.58965505 0.2011993
C  -3.53831068 2.17500947 0.4219183
C  0.01638323 -0.17271421 0.34083087
C  0.0627042 1.27714903 0.43544522
C  -1.08469884 2.00094034 0.47639888
C  -0.24223708 -2.93775319 -0.23784598
C  0.96127949 -2.41356321 0.16629272
C  1.10347184 -1.05941655 0.48875022
H  -0.31938857 -3.99007244 -0.4800248
H  1.82061066 -3.06504726 0.26305335
H  -1.0263528 3.08143751 0.52498707
H  -3.46783677 3.23426869 0.63570462
H  -5.83010239 -0.21077919 -0.28404615
H  -5.67381705 2.18974224 0.25436384
S  1.52808649 2.27077561 0.32326618
S  2.62596979 -0.63347759 1.29862392
S  4.10421589 -1.21988577 -0.07917891
S  2.2729181 1.83067207 -1.58728912
Li 2.49113536 -0.57263957 -1.78661052
Li 3.96655905 1.17469634 -0.03370116
energy: -2219.3790417988621
energyOcCorr: -2219.3794973440
s2: -0.00000000
charge: 0.000000
dipole: -26.643291 25.402547 -1.240743 -5.212384 4.333398 -0.878986 0.947218 -2.115100 -1.167883
quadrupole: 4838.891087 -4931.516829 -92.625742 1869.183729 -1973.466966 -104.283238 328.461317 -441.449105 -112.987787 -31.062718 36.646989 5.584271 -5.228349 0.930838 -4.297511 8.620558 4.317097 12.937655
temp: 298.15 k
press: 1.0 bar
thermalcorrgfe: 0.152081495342 hartree
thermalcorrener: 0.21785943680199998 hartree
entropy: 0.58754 kJ.mol-1.K-1
thermalcorrenthalpy: 0.218804018706 hartree
