title: ChemShell job
elementType: c
basis: def2-mSVP
elementType: h
elementType: s
elementType: li
method: uhf
method: dft
functional: pbeh-3c
elementType: c h s li
basis: def2-mSVP def2-mSVP def2-mSVP def2-mSVP
energy: -2242.089407740 hartree
zeropoint: 0.20041895076000002 hartree
formula: C16H8Li5S4
InChI: InChI=1/C16H8S3.5Li.S/c17-12-8-11-3-1-2-9-4-5-10-6-7-13(19-18)16(12)15(10)14(9)11;;;;;;/h1-8H;;;;;;/rC16H8Li5S4/c17-25(18)19-24-13-8-11-3-1-2-9-4-5-10-6-7-12(16(13)15(10)14(9)11)22-20(24)23(22)21(24)25/h1-8H
33 atoms
C  -2.22092537 -2.98971616 -0.3381369
C  -3.42506043 -2.46606996 0.05337776
C  -1.01730659 -2.27811689 -0.18184789
H  -4.33424431 -3.04406889 -0.06131638
C  -3.49722964 -1.16340953 0.5975838
C  -1.03146242 -0.96930663 0.38643691
C  -2.29615607 -0.41173232 0.74090719
H  -2.17907753 -3.98325794 -0.77030756
C  -4.72249033 -0.58755212 0.99149459
C  -2.36423289 0.91918975 1.23226439
C  -4.76470094 0.70188734 1.49887806
C  -3.61023979 1.45633966 1.62028786
C  0.18887089 -0.22182501 0.55925533
C  0.05851032 1.16008141 0.88085208
C  -1.17948271 1.6794754 1.24050483
C  0.22996242 -2.84441208 -0.5900623
C  1.39874574 -2.20479387 -0.27083545
C  1.43485403 -0.93608455 0.34626567
H  0.25032405 -3.822432 -1.05580817
H  2.34216311 -2.69478331 -0.48278922
H  -1.24327997 2.72601253 1.51715523
H  -3.65410552 2.4704577 1.99740964
H  -5.63390388 -1.1640365 0.88930914
H  -5.71523383 1.12813382 1.79624091
S  1.33853883 2.37533111 0.62803032
S  2.9684965 -0.56089749 1.0961099
S  4.29080255 0.39095259 -0.29524805
S  0.63422319 1.05913268 -2.93332538
Li 2.38313756 1.32012135 -1.38982631
Li 0.77518404 1.4141899 -5.17330445
Li 0.31767865 -1.07489056 -2.18912967
Li -0.23429508 2.34757734 -1.20958122
Li 3.44021649 1.76996722 1.46182725
energy: -2242.0894077397425
energyOcCorr: -2242.0908689124
s2: 0.80121871
charge: -0.000000
dipole: -25.168664 24.911634 -0.257030 -10.879252 13.109893 2.230641 12.967825 -19.293752 -6.325927
quadrupole: 4521.750265 -4657.649499 -135.899234 1737.731974 -1839.738341 -102.006367 1280.593558 -1340.650650 -60.057092 509.680028 -501.690299 7.989729 -602.212484 603.156104 0.943620 45.919394 -50.501278 -4.581884
temp: 298.15 k
press: 1.0 bar
thermalcorrgfe: 0.146985323618 hartree
thermalcorrener: 0.22421251186599997 hartree
entropy: 0.68839 kJ.mol-1.K-1
thermalcorrenthalpy: 0.22515709376999998 hartree
