title: ChemShell job
elementType: c
basis: def2-TZVPD
elementType: h
elementType: s
elementType: li
method: uhf
method: dft
functional: cam-b3lyp
elementType: c h s li
basis: def2-TZVPD def2-TZVPD def2-TZVPD def2-TZVPD
energy: -2252.934681099 hartree
formula: C16H8Li6S4
InChI: InChI=1/C16H8S2.6Li.2S/c17-12-7-6-10-5-4-9-2-1-3-11-8-13(18)16(12)15(10)14(9)11;;;;;;;;/h1-8H;;;;;;;;/q-1;;;;;;+1;;/rC16H8Li6S4/c17-25(18)20-26(19)21-23-12-7-6-10-5-4-9-2-1-3-11-8-13(24(21)22(25)26)16(12)15(10)14(9)11/h1-8H
34 atoms
C  -2.98745366 -2.37581073 0.71244792
C  -3.98852155 -1.7231388 0.08425999
C  -1.7578088 -1.71993781 1.03306788
H  -4.92258844 -2.22642275 -0.13596699
C  -3.83295056 -0.35358396 -0.29896697
C  -1.53802282 -0.37453096 0.62899793
C  -2.59750871 0.29500896 -0.05065899
H  -3.10467665 -3.41241461 1.00573789
C  -4.86725645 0.35616696 -0.91270589
C  -2.41659373 1.63508281 -0.45817595
C  -4.68800347 1.68025981 -1.28352586
C  -3.47567461 2.31474674 -1.06829488
C  -0.29792597 0.29313097 0.9109699
C  -0.05955299 1.56182583 0.22600597
C  -1.12159087 2.20932775 -0.33673596
C  -0.75388592 -2.37382673 1.7542288
C  0.36889096 -1.68259281 2.15745576
C  0.59650993 -0.32428496 1.83896979
H  -0.8798899 -3.41285061 2.03398177
H  1.09910487 -2.18115775 2.78086269
H  -0.94951689 3.16432764 -0.81951991
H  -3.33568062 3.34158862 -1.38515985
H  -5.81456334 -0.13648698 -1.09483387
H  -5.49954938 2.21933275 -1.7554858
S  1.53292583 2.21159075 -0.12746699
S  1.85846579 0.45827395 2.74382669
S  4.61730047 0.09236299 -0.64324593
S  1.54559682 -1.61301481 -2.20877875
Li 3.67718058 -1.89907678 -1.32459085
Li 0.64513893 -2.55727571 -4.06274754
Li 0.34420096 -1.7496688 -0.31054197
Li 2.44456672 0.49474094 -1.58791482
Li 3.27748863 1.07279588 0.99294889
Li 6.69888324 0.71295592 -1.24896186
energy: -2252.9346810988545
energyOcCorr: -2252.9424674490
s2: -0.00000000
charge: -0.000000
dipole: -37.379659 40.176150 2.796491 0.895343 -6.516035 -5.620692 7.289789 -14.679463 -7.389674
quadrupole: 5418.843714 -5462.785302 -43.941588 1646.795899 -1750.196340 -103.400441 1440.910799 -1544.923756 -104.012957 5.043023 -1.633429 3.409594 66.457193 -91.545464 -25.088271 -88.550773 102.414358 13.863585
