title: ChemShell job
elementType: c
basis: def2-TZVPD
elementType: h
elementType: s
elementType: li
method: uhf
method: dft
functional: cam-b3lyp
elementType: c h s li
basis: def2-TZVPD def2-TZVPD def2-TZVPD def2-TZVPD
energy: -2268.112399353 hartree
formula: C16H8Li8S4
InChI: InChI=1/C16H8S.8Li.3S/c17-14-9-7-12-5-4-10-2-1-3-11-6-8-13(14)16(12)15(10)11;;;;;;;;;;;/h1-7,9H;;;;;;;;;;;/rC16H8Li8S4/c1-2-9-4-5-10-6-7-12-15-14(10)13(9)11(3-1)8-16(15)20-22(16)25(12)17-27-18-26-19-28(20,22,21(25)27)23(26,27)24(26,27)28/h1-8H
36 atoms
C  -2.03956577 -2.6740987 -0.47442795
C  -3.15625264 -1.84110879 -0.37789796
C  -0.74058892 -2.11092276 -0.38460295
H  -4.14780353 -2.27252274 -0.44610695
C  -3.00098766 -0.47511594 -0.19630998
C  -0.59279193 -0.71748492 -0.20118798
C  -1.7338358 0.08272099 -0.10783299
H  -3.87488856 0.15952298 -0.12421799
H  -1.62046882 1.15198887 0.030687
C  0.73818092 -0.17823798 -0.14927898
H  0.78961291 0.9064759 -0.030559
C  0.41877095 -2.93405567 -0.47274995
C  1.71665481 -2.35041674 -0.37962296
C  1.89161378 -0.9109369 -0.24791197
C  2.83104668 -3.22497064 -0.41690196
C  0.24614397 -4.33035951 -0.64605593
C  -2.16852575 -4.08679854 -0.65983992
C  -1.07291288 -4.87469045 -0.74077492
C  2.6393027 -4.59812548 -0.59173493
C  1.37705284 -5.14259642 -0.71371392
H  3.50328061 -5.25038741 -0.62196493
H  1.26214986 -6.2117193 -0.8493469
H  -1.17997587 -5.94447433 -0.8776289
H  -3.16093564 -4.51535349 -0.73123692
S  4.48286149 -2.6390357 -0.18980998
S  7.16932819 -1.95754278 -2.74455569
S  4.78364446 0.83744391 -1.84512279
S  8.36189605 1.52069383 -2.45097872
Li 6.57221925 0.33690896 -3.5576966
Li 7.0535112 -0.05583499 -1.17776486
Li 6.40730527 -3.62661959 -1.32511985
Li 9.09348797 -0.62449093 -2.92885167
Li 4.92558344 -1.49063783 -2.28990174
Li 3.92919756 -0.33307096 0.10384999
Li 6.39021027 2.57178971 -1.87894379
Li 2.50484172 0.38564596 -1.90218278
energy: -2268.1123993531833
energyOcCorr: -2268.1203195947
s2: -0.00000000
charge: -0.000000
dipole: 969.587786 -969.830146 -0.242360 -582.987622 582.570493 -0.417129 -386.964579 386.283052 -0.681526
quadrupole: 14078.716655 -14231.703753 -152.987097 4664.216061 -4779.608399 -115.392338 1448.484216 -1576.405970 -127.921753 -878.594155 845.334210 -33.259945 -3846.298610 3859.032125 12.733514 613.836233 -605.753549 8.082684
