title: ChemShell job
elementType: c
basis: def2-TZVPD
elementType: h
elementType: s
elementType: li
method: uhf
method: dft
functional: cam-b3lyp
elementType: c h s li
basis: def2-TZVPD def2-TZVPD def2-TZVPD def2-TZVPD
energy: -2275.627350098 hartree
formula: C16H8Li9S4
InChI: InChI=1/C16H8S.9Li.3S/c17-14-9-7-12-5-4-10-2-1-3-11-6-8-13(14)16(12)15(10)11;;;;;;;;;;;;/h1-7,9H;;;;;;;;;;;;/rC16H8Li9S4/c1-2-9-4-5-10-6-7-12-15-14(10)13(9)11(3-1)8-16(15)21-23(16)27(12)19-28(20-27)22-25(28)24(27,28)29(21,23,25)17-26(22,25)18-29/h1-8H
37 atoms
C  -2.03676277 -2.5946337 -0.05350999
C  -3.11092465 -1.67299481 0.08077399
C  -0.71600592 -2.09138776 -0.27943697
H  -4.11259053 -2.05130777 0.25163397
C  -2.87919367 -0.30967996 -0.006515
C  -0.50227194 -0.68767992 -0.36952896
C  -1.60692282 0.19389398 -0.22602097
H  -3.71229458 0.37748296 0.09874699
H  -1.44073483 1.26336686 -0.29336397
C  0.81624291 -0.23538597 -0.60418493
H  0.93129189 0.8534439 -0.64297393
C  0.39155195 -2.98536366 -0.41630495
C  1.70793881 -2.46071872 -0.65002292
C  1.93527578 -1.05079588 -0.75942591
C  2.77729668 -3.42004361 -0.76116292
C  0.15425098 -4.3949525 -0.32203896
C  -2.22111175 -3.98787755 0.024803
C  -1.15823587 -4.85817245 -0.10472999
C  2.52763072 -4.78229246 -0.66024492
C  1.25349086 -5.2795054 -0.45244795
H  3.35661962 -5.47639338 -0.75107391
H  1.08926988 -6.34859228 -0.38332395
H  -1.32608585 -5.92783533 -0.03843499
H  -3.22058064 -4.3753605 0.19160698
S  4.44370049 -2.88278467 -1.05624188
S  7.47153615 -1.98373177 -2.17822775
S  4.78579846 0.8617239 -2.29375874
S  8.28649206 1.85025479 -1.86386079
Li 7.08099819 0.20272198 -3.04395466
Li 6.44430927 1.22745186 -0.58967393
Li 6.24556629 -4.01012655 -2.28995574
Li 9.06373397 -0.33985796 -1.46767483
Li 5.16791041 -1.43072884 -2.76921268
Li 3.95024655 -0.56512594 -0.51238394
Li 6.28992729 2.71152269 -2.79513568
Li 2.50801672 0.21622498 -2.38110773
Li 6.61856225 -2.34365373 -0.018847
energy: -2275.6273500976918
energyOcCorr: -2275.6350624286
s2: 0.79265224
charge: -0.000000
dipole: 1011.885699 -1001.407598 10.478100 -591.216278 592.347507 1.131229 -379.465544 377.541313 -1.924231
quadrupole: 14628.388676 -14683.930871 -55.542195 5014.646376 -5147.822497 -133.176121 1317.780639 -1427.741602 -109.960963 -934.209305 873.059662 -61.149642 -3870.728138 3863.764747 -6.963391 487.677876 -482.705641 4.972235
