title: ChemShell job
elementType: c
basis: def2-mSVP
elementType: n
elementType: h
elementType: s
method: uhf
method: dft
functional: pbeh-3c
elementType: c n h s
basis: def2-mSVP def2-mSVP def2-mSVP def2-mSVP
energy: -2633.976504151 hartree
zeropoint: 0.17627117143999999 hartree
formula: C14H6N2S5
InChI: InChI=1/C14H6N2S5/c17-10-4-7-3-9-13-8(18-20-21-19-9)2-1-6-5-15-14(16-10)12(7)11(6)13/h1-5,16H
27 atoms
C  -1.77554001 -2.48511132 0.19750768
N  -2.84259338 -1.74371202 0.17264648
C  -0.44480017 -1.98757185 0.09861443
C  -2.66482818 -0.41451605 0.04200531
C  -0.26295724 -0.59677616 -0.03859671
C  -1.42205946 0.19907676 -0.0693418
H  -1.92398881 -3.55490235 0.30160264
N  -3.77272632 0.3589329 0.01854322
C  -1.36260346 1.60714274 -0.21247918
C  -3.79138323 1.71897784 -0.10462438
C  -2.52395627 2.34107454 -0.22766925
C  1.03054948 -0.01723576 -0.15196809
C  1.06779139 1.43338136 -0.30018824
C  -0.05742975 2.18672952 -0.3311572
C  0.66667086 -2.8306674 0.13212978
C  1.92473008 -2.28566254 0.03462493
C  2.11361956 -0.90414688 -0.10123719
H  0.54007416 -3.90025516 0.23840574
H  2.79170459 -2.93098281 0.06768743
H  0.01762195 3.26037184 -0.44443256
H  -2.49614892 3.41621828 -0.33328599
S  2.58551709 2.33067055 -0.55565122
S  3.81651231 -0.40848572 -0.29042583
S  4.26807568 0.39650526 1.48949388
S  3.37807182 2.42807296 1.28541181
S  -5.24933347 2.54328885 -0.10177318
H  -4.66660543 -0.11229866 0.10375735
energy: -2633.9765041513056
energyOcCorr: -2633.9767042212
s2: -0.00000000
charge: 0.000000
dipole: 82.625919 -80.603049 2.022871 171.802055 -174.896843 -3.094787 45.940528 -46.193186 -0.252658
quadrupole: 6166.291004 -6319.195930 -152.904925 2237.195187 -2344.479451 -107.284264 255.585153 -373.759695 -118.174542 -217.513939 231.433646 13.919706 490.112244 -492.351084 -2.238839 35.659691 -37.475125 -1.815434
temp: 298.15 k
press: 1.0 bar
thermalcorrgfe: 0.131186429514 hartree
thermalcorrener: 0.192241461454 hartree
entropy: 0.54595 kJ.mol-1.K-1
thermalcorrenthalpy: 0.193186043358 hartree
