title: ChemShell job
elementType: c
basis: def2-mSVP
elementType: n
elementType: h
elementType: s
elementType: li
method: uhf
method: dft
functional: pbeh-3c
elementType: c n h s li
basis: def2-mSVP def2-mSVP def2-mSVP def2-mSVP def2-mSVP
energy: -2709.688487359 hartree
zeropoint: 0.18781182938 hartree
formula: C14H6Li10N2S5
InChI: InChI=1/C14H6N2S.10Li.4S/c17-11-6-9-5-4-8-2-1-3-10-7-15-14(16-11)13(9)12(8)10;;;;;;;;;;;;;;/h1,3,5-7,16H;;;;;;;;;;;;;;/q-1;;;;;;;;;;+1;;;;/rC14H6Li10N2S5/c15-28-21-22(28)31(21)20-30-19-29(16)18-27(24(29)30)10-4-7-3-9-13-8(17-9)2-1-6-5-26(23(30)31)14(25-10)12(7)11(6)13/h1-5,25H
37 atoms
C  1.69886614 0.35703078 -1.85892442
N  0.63859688 -0.25540635 -1.39414929
C  2.10032611 1.6559619 -1.47371374
C  -0.14708518 0.41149687 -0.51225236
C  1.30567896 2.32519529 -0.52176685
C  0.14566057 1.69283482 -0.05294294
H  2.30734881 -0.19962646 -2.56447592
N  -1.24004221 -0.22098271 -0.04014012
C  -0.68332265 2.32256315 0.91231481
C  -2.08869288 0.33860498 0.86179243
C  -1.81621806 1.6140298 1.33340347
C  1.69179904 3.57902287 0.01472774
C  0.86294373 4.25342865 1.00841851
C  -0.29217767 3.60591138 1.39212461
C  3.29087562 2.26812718 -1.90081009
C  3.66355681 3.48918592 -1.3582739
C  2.90273591 4.19934146 -0.39076173
H  3.92168065 1.76716961 -2.62748511
H  4.6032944 3.91153248 -1.70323524
H  -0.9591468 4.05961597 2.12295913
H  -2.48996658 2.04947681 2.05879125
S  -3.45201632 -0.58325867 1.40022558
H  -1.37446538 -1.22111593 -0.309552
Li 2.35615079 5.73087852 0.94629844
Li -3.18969647 -2.94528951 0.6101474
S  -1.23445734 -3.42734312 -0.61486909
Li 0.79124632 -2.3362446 -1.21158074
Li 0.52281356 -4.15013161 0.72887379
S  2.45703402 -2.97264864 0.32165394
Li 2.25746073 -1.06139287 1.64926959
Li -3.08943663 -3.87766581 -1.92226105
S  -5.05716051 -3.26014055 -0.85444044
Li -6.81114943 -4.58431956 -0.32364926
Li 4.32366432 -1.57857441 0.2477158
S  4.15776054 0.22426901 1.68861623
Li 3.74224991 2.23050396 0.81356825
Li -4.92577965 -0.99736469 -0.51423209
energy: -2709.6884873585277
energyOcCorr: -2709.6936189507
s2: -0.00000000
charge: 0.000000
dipole: 29.251919 -38.520626 -9.268707 -2.468010 -0.261089 -2.729098 10.938532 -14.318322 -3.379789
quadrupole: 6381.726224 -6452.163561 -70.437337 5236.198003 -5328.629145 -92.431143 985.770201 -1126.359910 -140.589709 2632.571540 -2559.724951 72.846588 19.159104 -36.118183 -16.959079 322.526387 -317.781120 4.745267
temp: 298.15 k
press: 1.0 bar
thermalcorrgfe: 0.12220147503199999 hartree
thermalcorrener: 0.220845534434 hartree
entropy: 0.87696 kJ.mol-1.K-1
thermalcorrenthalpy: 0.22179011633799997 hartree
