title: ChemShell job
elementType: c
basis: def2-TZVPD
elementType: n
elementType: h
elementType: s
elementType: li
method: uhf
method: dft
functional: cam-b3lyp
elementType: c n h s li
basis: def2-TZVPD def2-TZVPD def2-TZVPD def2-TZVPD def2-TZVPD
energy: -1856.443368837 hartree
formula: C14H6Li2N2S3
InChI: InChI=1/C14H6N2S3.2Li/c17-8-2-1-6-5-15-14-12-7(4-10(19)16-14)3-9(18)13(8)11(6)12;;/h1-5,16H;;/rC14H6Li2N2S3/c19-10-4-7-3-9-13-8(20-15-21(9)16-20)2-1-6-5-17-14(18-10)12(7)11(6)13/h1-5,18H
27 atoms
C  -0.81562391 -3.13380765 0.25349497
N  -2.01682177 -2.6258617 0.18877598
C  0.38231496 -2.38694773 0.19897198
C  -2.09482176 -1.29027985 0.06533099
C  0.30857996 -0.98053189 0.09780099
C  -0.99053489 -0.44002695 0.030502
H  -0.74912092 -4.21322652 0.35029596
N  -3.33365562 -0.75252292 -0.03261899
C  -1.20174986 0.95576289 -0.09354499
C  -3.60958659 0.57980894 -0.17061098
C  -2.49861672 1.43770684 -0.19836498
C  1.47095283 -0.14934198 0.04260699
C  1.22798286 1.29872585 0.07257199
C  -0.05202899 1.7807398 -0.048918
C  1.64192781 -3.00027766 0.22731398
C  2.75882769 -2.22930975 0.09251699
C  2.72024269 -0.81563991 -0.04496299
H  1.7243048 -4.07595054 0.32556196
H  3.73010658 -2.70374169 0.06726799
H  -0.19942698 2.85323268 -0.04597199
H  -2.67895469 2.49946272 -0.29483497
S  2.43882472 2.53874771 0.37344896
S  4.29544451 -0.13017499 -0.39051896
S  -5.21860141 1.07823488 -0.29011197
H  -4.11832353 -1.39194984 -0.008814
Li 3.81156057 1.95041178 -1.47024383
Li 4.21587352 1.38272084 1.46571184
energy: -1856.4433688367308
energyOcCorr: -1856.4478399181
s2: 0.00000000
charge: -0.000000
dipole: 7.701445 1.452721 9.154166 -28.597351 28.569359 -0.027992 -0.554918 0.910462 0.355544
quadrupole: 4860.785820 -4978.437784 -117.651965 1772.695239 -1867.850523 -95.155284 75.465460 -168.494157 -93.028698 -25.641044 57.756555 32.115512 81.652391 -80.921979 0.730412 -55.019797 49.946887 -5.072909
