title: ChemShell job
elementType: c
basis: def2-mSVP
elementType: n
elementType: h
elementType: li
elementType: s
method: uhf
method: dft
functional: pbeh-3c
elementType: c n h li s
basis: def2-mSVP def2-mSVP def2-mSVP def2-mSVP def2-mSVP
energy: -1058.006675351 hartree
zeropoint: 0.16792990381999998 hartree
formula: C14H6Li2N2S
InChI: InChI=1/C14H6N2S.2Li/c17-11-6-9-5-4-8-2-1-3-10-7-15-14(16-11)13(9)12(8)10;;/h1,3,5-7,16H;;/q-1;;+1/rC14H6Li2N2S/c15-19-10-4-7-3-9-13-8(16-9)2-1-6-5-17-14(18-10)12(7)11(6)13/h1-5,18H
25 atoms
C  -1.90840091 -2.52303292 0.03902877
N  -2.98880852 -1.78043534 0.06300096
C  -0.58742248 -2.02142165 0.00349594
C  -2.81871263 -0.44522658 0.04701652
C  -0.42455057 -0.62188212 -0.02290015
C  -1.57397169 0.18062102 -0.0056982
H  -2.06633252 -3.59793963 0.05152652
N  -3.9257102 0.3331286 0.0824001
C  -1.47028499 1.59711102 -0.03160542
C  -3.90289038 1.69655655 0.0612416
C  -2.66981363 2.32641418 0.00653127
C  0.85855023 -0.02405432 -0.05657194
C  0.99973649 1.42462761 -0.09285383
C  -0.16727348 2.16563562 -0.08308036
C  0.56937922 -2.82232396 0.00196927
C  1.81541981 -2.22555613 -0.01930636
C  2.02929217 -0.82309846 -0.05182025
H  0.46964452 -3.90274842 0.02179046
H  2.67516617 -2.89091967 -0.01281366
H  -0.1276719 3.25341533 -0.10824367
H  -2.64349031 3.40821711 0.00684886
Li 3.04854812 0.99655997 -0.1169175
Li -5.26535271 3.85933031 -1.76994213
S  -5.42521967 2.50758161 0.14021357
H  -4.82590801 -0.12869141 0.11819645
energy: -1058.0066753510043
energyOcCorr: -1058.0090272792
s2: -0.00000000
charge: 0.000000
dipole: -385.277154 381.770987 -3.506167 52.922523 -49.417985 3.504538 -6.707337 3.679003 -3.028333
quadrupole: 3878.243803 -3918.481604 -40.237801 1726.073397 -1770.391537 -44.318140 35.865238 -110.787172 -74.921934 -1205.861198 1174.751039 -31.110159 22.956490 7.147147 30.103636 -64.419760 41.499578 -22.920182
temp: 298.15 k
press: 1.0 bar
thermalcorrgfe: 0.125092352714 hartree
thermalcorrener: 0.182011030026 hartree
entropy: 0.50954 kJ.mol-1.K-1
thermalcorrenthalpy: 0.18295561193 hartree
