title: ChemShell job
elementType: c
basis: def2-TZVPD
elementType: n
elementType: h
elementType: s
elementType: li
method: uhf
method: dft
functional: cam-b3lyp
elementType: c n h s li
basis: def2-TZVPD def2-TZVPD def2-TZVPD def2-TZVPD def2-TZVPD
energy: -2254.660842883 hartree
formula: C14H6Li2N2S4
InChI: InChI=1/C14H7N2S4.2Li/c17-8-3-7-4-10(18)16-14-12(7)11-6(5-15-14)1-2-9(20-19)13(8)11;;/h1-5,16,19H;;/q;;+1/p-1/rC14H6Li2N2S4/c19-10-4-7-3-9-13-8(22-16-21(9)15-20-22)2-1-6-5-17-14(18-10)12(7)11(6)13/h1-5,18H
28 atoms
C  -1.42851484 -3.14455764 0.007207
N  -2.58279171 -2.54757871 0.08069599
C  -0.18060698 -2.47593072 -0.11154999
C  -2.57908371 -1.20107086 0.028075
C  -0.18259998 -1.06935588 -0.20995998
C  -1.43434384 -0.43257995 -0.14505398
H  -1.43518884 -4.22910052 0.05479299
N  -3.76977357 -0.57189594 0.16209598
C  -1.54555082 0.97923289 -0.21721998
C  -3.94947455 0.78354291 0.14515098
C  -2.79263068 1.55856382 -0.06954799
C  1.02060788 -0.31293296 -0.32338897
C  0.8714139 1.11361287 -0.63554493
C  -0.35829896 1.7035608 -0.51225994
C  1.03853688 -3.15988464 -0.09599599
C  2.20284875 -2.43542872 -0.06098599
C  2.20991975 -1.02988888 -0.12394098
H  1.06112788 -4.24067652 -0.044465
H  3.14649264 -2.95108066 0.05921499
H  -0.45056095 2.76109169 -0.72535492
H  -2.90551467 2.6323887 -0.11470199
S  2.12780776 2.11612076 -1.34086785
S  3.81931057 -0.34314896 0.19110698
S  3.61728659 0.95659589 1.7861948
S  -5.49200638 1.41789784 0.38192396
H  -4.58825148 -1.15026487 0.30571297
Li 2.92304267 2.93460567 0.72956592
Li 4.12941453 0.97708989 -1.79429279
energy: -2254.6608428826180
energyOcCorr: -2254.6656035341
s2: 0.00000000
charge: -0.000000
dipole: -11.283119 18.529070 7.245950 -10.692323 10.275881 -0.416441 0.726022 -3.414258 -2.688236
quadrupole: 5569.458112 -5710.719265 -141.261153 1861.518619 -1950.375510 -88.856891 359.117705 -474.943161 -115.825456 12.727458 16.845292 29.572750 25.681259 -46.713685 -21.032426 -63.722109 66.512082 2.789973
