title: ChemShell job
elementType: c
basis: def2-mSVP
elementType: n
elementType: h
elementType: s
elementType: li
method: uhf
method: dft
functional: pbeh-3c
elementType: c n h s li
basis: def2-mSVP def2-mSVP def2-mSVP def2-mSVP def2-mSVP
energy: -2649.156760656 hartree
zeropoint: 0.17836601034 hartree
formula: C14H6Li2N2S5
InChI: InChI=1/C14H6N2S5.2Li/c17-10-4-7-3-9(21-19)13-8(20-18)2-1-6-5-15-14(16-10)12(7)11(6)13;;/h1-5,16H;;/rC14H6Li2N2S5/c19-10-4-7-3-9-13-8(20-22-15-23(16-22)21-9)2-1-6-5-17-14(18-10)12(7)11(6)13/h1-5,18H
29 atoms
C  -1.76214516 -2.94932139 -0.63813091
N  -2.91845417 -2.35194871 -0.58700489
C  -0.52253256 -2.33108424 -0.32839995
C  -2.91956832 -1.05805205 -0.2204077
C  -0.52328183 -0.97334367 0.04321612
C  -1.77404865 -0.33300824 0.09021104
H  -1.76350496 -3.99352493 -0.9335961
N  -4.11831833 -0.43391473 -0.15274914
C  -1.90058272 1.03105429 0.45283035
C  -4.3158569 0.87049791 0.19701287
C  -3.14798802 1.60802707 0.50641241
C  0.67798879 -0.27613141 0.37500246
C  0.53959464 1.16291061 0.59061393
C  -0.68230781 1.75313353 0.65593383
C  0.68930166 -3.03216677 -0.36306045
C  1.83689271 -2.40340695 0.03641626
C  1.84883423 -1.05023932 0.43418064
H  0.7097454 -4.07394975 -0.65585712
H  2.76500937 -2.95831767 0.06784148
H  -0.74598033 2.82390011 0.7972444
H  -3.26363832 2.64926837 0.77274009
S  1.89370423 2.29781769 0.71007863
S  3.37424423 -0.50481616 1.15609041
S  4.80898096 -1.02232147 -0.28636482
S  2.80815501 2.16666407 -1.16651368
S  -5.86771587 1.50730788 0.22622071
H  -4.93823461 -0.98278365 -0.38474895
Li 3.17081567 -0.137665 -1.85654868
Li 4.80195397 1.39604804 -0.07560484
energy: -2649.1567606558906
energyOcCorr: -2649.1573869194
s2: -0.00000000
charge: 0.000000
dipole: 15.057335 -10.334435 4.722899 1.826130 -4.238822 -2.412692 18.731069 -20.492620 -1.761552
quadrupole: 6952.480227 -7100.338650 -147.858422 2027.276056 -2145.382175 -118.106120 295.923313 -412.385479 -116.462166 -240.277365 262.850057 22.572692 -67.055082 60.090105 -6.964977 168.680612 -160.001790 8.678823
temp: 298.15 k
press: 1.0 bar
thermalcorrgfe: 0.129282030514 hartree
thermalcorrener: 0.19798132003999996 hartree
entropy: 0.61328 kJ.mol-1.K-1
thermalcorrenthalpy: 0.19892590194399998 hartree
