title: ChemShell job
elementType: c
basis: def2-mSVP
elementType: n
elementType: h
elementType: s
elementType: li
method: uhf
method: dft
functional: pbeh-3c
elementType: c n h s li
basis: def2-mSVP def2-mSVP def2-mSVP def2-mSVP def2-mSVP
energy: -1861.218438913 hartree
zeropoint: 0.17333839698 hartree
formula: C14H6Li3N2S3
InChI: InChI=1/C14H6N2S3.3Li/c17-8-2-1-6-5-15-14-12-7(4-10(19)16-14)3-9(18)13(8)11(6)12;;;/h1-5,16H;;;/q-1;;;+1/rC14H6Li3N2S3/c15-19-5-6-1-2-8-13-9(22-16-21(8)17-22)3-7-4-10(20)18-14(19)12(7)11(6)13/h1-5,18H
28 atoms
C  -0.78433609 -3.14055798 0.25134876
N  -2.02383551 -2.60905787 0.18109703
C  0.39338031 -2.39914349 0.19746503
C  -2.11117523 -1.29248901 0.05954607
C  0.31529998 -0.97660317 0.08620283
C  -0.98859933 -0.43245534 0.02008659
H  -0.72670041 -4.21892251 0.34717105
N  -3.34782817 -0.72909414 -0.0327572
C  -1.1955101 0.95755689 -0.08974142
C  -3.60622346 0.62271887 -0.17222818
C  -2.51740286 1.4633337 -0.19801406
C  1.48027442 -0.14635303 0.04341695
C  1.23788246 1.27774049 0.07945918
C  -0.05571568 1.76620455 -0.03523301
C  1.66977107 -3.00126515 0.24315794
C  2.78933959 -2.21686424 0.1122297
C  2.75572277 -0.81939556 -0.02725267
H  1.75884462 -4.07574317 0.34469854
H  3.75990555 -2.69633439 0.08847099
H  -0.19289774 2.84116294 -0.03554112
H  -2.67997538 2.52814819 -0.29329884
S  2.44331932 2.54402867 0.37365993
S  4.33782196 -0.11095485 -0.40407743
S  -5.24713529 1.08397876 -0.29143709
H  -4.15738722 -1.33156374 -0.01011052
Li 3.7934266 1.92589498 -1.46142822
Li 4.19537488 1.3587756 1.43495717
Li -3.45747294 -3.97017116 0.24260298
energy: -1861.2184389132494
energyOcCorr: -1861.2204982974
s2: 0.81916505
charge: 0.000000
dipole: -10.214971 13.357595 3.142624 -49.377452 43.596675 -5.780778 0.758070 -0.049334 0.708736
quadrupole: 5042.755604 -5143.792994 -101.037390 1939.991899 -1995.979756 -55.987857 75.608372 -172.298631 -96.690259 105.741468 -30.033602 75.707866 73.033916 -75.416832 -2.382916 -66.865030 59.404240 -7.460790
temp: 298.15 k
press: 1.0 bar
thermalcorrgfe: 0.128303169428 hartree
thermalcorrener: 0.190740795042 hartree
entropy: 0.55815 kJ.mol-1.K-1
thermalcorrenthalpy: 0.191685376946 hartree
