title: ChemShell job
elementType: c
basis: def2-mSVP
elementType: n
elementType: h
elementType: s
elementType: li
method: uhf
method: dft
functional: pbeh-3c
elementType: c n h s li
basis: def2-mSVP def2-mSVP def2-mSVP def2-mSVP def2-mSVP
energy: -1463.398427933 hartree
zeropoint: 0.17051988646 hartree
formula: C14H6Li3N2S2
InChI: InChI=1/C14H6N2S2.3Li/c17-10-4-2-8-6-15-14-13-7(5-11(18)16-14)1-3-9(10)12(8)13;;;/h1-2,4-6,16H;;;/q-1;;;+1/rC14H6Li3N2S2/c15-19-5-6-1-2-8-12-10(6)11-7(3-9(20)18-13(11)19)4-14(12)16-17(14)21(8)16/h1-5,18H
27 atoms
C  -0.17739861 -2.83366254 -0.00685592
N  -1.48397338 -2.46451166 -0.0126318
C  0.88738832 -1.93087401 0.00025325
C  -1.76253988 -1.16878856 -0.00465256
C  0.58326372 -0.53672144 0.00057011
C  -0.77412337 -0.15572189 0.00044711
H  0.02009034 -3.899562 -0.00984768
N  -3.06481173 -0.77106958 -0.00356003
C  -1.1557595 1.20176736 0.00084774
C  -3.50372808 0.54240734 -0.00074946
C  -2.54060152 1.52423123 0.00122119
C  1.58614183 0.46050241 0.00037199
C  1.23850554 1.85439539 -0.00224703
C  -0.11381852 2.1589499 -0.00153254
C  2.24934078 -2.30890777 0.00445989
C  3.24259921 -1.34118272 0.00502131
C  2.95967779 0.02582768 0.00122655
H  2.51591468 -3.35884307 0.0058897
H  4.27837738 -1.65825269 0.0072791
H  -0.42438635 3.20313587 -0.00357712
H  -2.85226049 2.55945939 0.00238605
S  4.27401038 1.21053375 -0.00420682
S  -5.19788487 0.77972194 -0.00103369
H  -3.78871247 -1.47470438 -0.00198251
Li 2.78304391 2.61961431 1.2752089
Li 2.77511151 2.5801963 -1.31136409
Li -2.7144544 -4.0078856 -0.09885752
energy: -1463.3984279330689
energyOcCorr: -1463.4002071222
s2: 0.81733706
charge: 0.000000
dipole: -41.630069 43.816546 2.186477 -13.047875 9.330454 -3.717420 -1.156119 0.953254 -0.202865
quadrupole: 4433.286719 -4575.282696 -141.995977 1480.091903 -1501.598862 -21.506958 35.958112 -124.251138 -88.293026 136.536436 -75.243528 61.292907 2.874079 -2.202653 0.671425 4.354782 -3.157342 1.197440
temp: 298.15 k
press: 1.0 bar
thermalcorrgfe: 0.124730516904 hartree
thermalcorrener: 0.187453802368 hartree
entropy: 0.56065 kJ.mol-1.K-1
thermalcorrenthalpy: 0.188394575474 hartree
