title: ChemShell job
elementType: c
basis: def2-mSVP
elementType: n
elementType: h
elementType: s
elementType: li
method: uhf
method: dft
functional: pbeh-3c
elementType: c n h s li
basis: def2-mSVP def2-mSVP def2-mSVP def2-mSVP def2-mSVP
energy: -2656.718339393 hartree
zeropoint: 0.1772995469 hartree
formula: C14H6Li3N2S5
InChI: InChI=1/C14H6N2S5.3Li/c17-10-4-7-3-9(21-19)13-8(20-18)2-1-6-5-15-14(16-10)12(7)11(6)13;;;/h1-5,16H;;;/q-1;;;+1/rC14H6Li3N2S5/c15-19-5-6-1-2-8-13-9(22-24-16-23(17-24)21-8)3-7-4-10(20)18-14(19)12(7)11(6)13/h1-5,18H
30 atoms
C  -1.7258663 -2.9596829 -0.44877125
N  -2.91750993 -2.33828567 -0.42836394
C  -0.50980861 -2.33408858 -0.19367886
C  -2.92726383 -1.03616293 -0.15969889
C  -0.50978095 -0.9379029 0.0834004
C  -1.75871779 -0.28541293 0.08370277
H  -1.73742723 -4.02090542 -0.67224612
N  -4.12005074 -0.38480233 -0.11757314
C  -1.87019621 1.10353419 0.31903792
C  -4.29198256 0.96180452 0.13714676
C  -3.14351203 1.70443835 0.34954904
C  0.69193821 -0.22169857 0.35168343
C  0.56850169 1.20672701 0.40285223
C  -0.66438582 1.82008343 0.42387158
C  0.72373349 -3.03269068 -0.18839481
C  1.86049245 -2.37846969 0.20222379
C  1.88077536 -1.00190778 0.51090148
H  0.74877649 -4.08875115 -0.423663
H  2.78499025 -2.93505458 0.29971594
H  -0.70833457 2.90138961 0.46002418
H  -3.23702815 2.76496051 0.5329615
S  1.93829901 2.32240615 0.28834836
S  3.30870644 -0.41380665 1.37390793
S  4.89073112 -0.71726728 0.00792071
S  2.67454506 1.92682452 -1.6406031
S  -5.87958288 1.56541846 0.15908197
H  -4.96602684 -0.91371237 -0.27788012
Li -4.42492065 -3.56119248 -0.8611179
Li 3.05037341 -0.46224244 -1.56157206
Li 4.79110571 1.59032023 -0.57980542
energy: -2656.7183393926653
energyOcCorr: -2656.7197354223
s2: 0.80258395
charge: 0.000000
dipole: -9.942905 8.895846 -1.047059 -3.901165 -4.075769 -7.976934 2.553615 -5.676919 -3.123305
quadrupole: 7145.012823 -7268.505639 -123.492816 2112.862772 -2200.052895 -87.190123 343.438917 -467.422254 -123.983337 -68.925582 146.003547 77.077965 2.271830 -0.791741 1.480089 -1.544541 19.177083 17.632542
temp: 298.15 k
press: 1.0 bar
thermalcorrgfe: 0.12915253138199997 hartree
thermalcorrener: 0.19711672289399998 hartree
entropy: 0.60679 kJ.mol-1.K-1
thermalcorrenthalpy: 0.198061304798 hartree
