title: ChemShell job
elementType: c
basis: def2-TZVPD
elementType: n
elementType: h
elementType: s
elementType: li
method: uhf
method: dft
functional: cam-b3lyp
elementType: c n h s li
basis: def2-TZVPD def2-TZVPD def2-TZVPD def2-TZVPD def2-TZVPD
energy: -2668.062501446 hartree
formula: C14H6Li4N2S5
InChI: InChI=1/C14H7N2S4.4Li.S/c17-8-3-7-4-10(18)16-14-12(7)11-6(5-15-14)1-2-9(20-19)13(8)11;;;;;/h1-5,16,19H;;;;;/q-1;;;2*+1;/p-1/rC14H6Li4N2S5/c15-22-16-20-5-6-1-2-8-13-9(24-17-23-25(8)18-24)3-7-4-10(21)19-14(20)12(7)11(6)13/h1-5,19H
31 atoms
C  -1.41028184 -2.48750572 -0.27695897
N  -2.37506873 -1.61127882 -0.20053398
C  -0.033773 -2.16577575 -0.30134396
C  -2.03243877 -0.29893897 -0.14228899
C  0.33470396 -0.80561991 -0.29864497
C  -0.71066292 0.13157898 -0.22629897
H  -1.69902781 -3.5330166 -0.31596397
N  -3.02256066 0.60755393 -0.001018
C  -0.43639695 1.52257583 -0.21514597
C  -2.81922368 1.95639578 0.05868299
C  -1.48699083 2.40362873 -0.07194799
C  1.70072981 -0.39473495 -0.33074496
C  1.94968478 1.03310289 -0.55382194
C  0.9136409 1.91668078 -0.42942895
C  0.95597189 -3.15377564 -0.29659697
C  2.26537374 -2.76988069 -0.17594798
C  2.6464977 -1.41427384 -0.15155398
H  0.68565692 -4.20220552 -0.32208896
H  3.03447366 -3.5226756 -0.06454899
H  1.11238887 2.97121266 -0.57865693
H  -1.30814985 3.47034461 -0.05764399
S  3.45520061 1.7118678 -1.14760587
S  4.3732775 -1.20800786 0.22036898
S  4.51001649 -0.02844799 1.91363278
S  -4.11988953 3.00141466 0.27958397
H  -4.01111854 0.25255997 0.09192699
Li 4.33375751 2.12692276 1.01571389
Li 5.09633142 0.12766299 -1.65557281
Li -7.87152811 -1.7517708 0.38621495
S  -5.88162533 -0.81327191 0.25272197
Li -4.30171751 -2.28105674 -0.24884897
energy: -2668.0625014457128
energyOcCorr: -2668.0732646540
s2: -0.00000000
charge: 0.000000
dipole: 0.404462 5.382654 5.787116 -2.772153 -3.212625 -5.984778 -0.639368 -2.330649 -2.970017
quadrupole: 8514.260281 -8590.823497 -76.563216 2271.492085 -2379.715673 -108.223588 365.153195 -498.099949 -132.946754 -371.147180 451.347609 80.200429 65.658020 -85.401466 -19.743446 -29.842278 40.894313 11.052035
