title: ChemShell job
elementType: c
basis: def2-TZVPD
elementType: n
elementType: h
elementType: s
elementType: li
method: uhf
method: dft
functional: cam-b3lyp
elementType: c n h s li
basis: def2-TZVPD def2-TZVPD def2-TZVPD def2-TZVPD def2-TZVPD
energy: -2683.282660595 hartree
formula: C14H6Li6N2S5
InChI: InChI=1/C14H6N2S3.6Li.2S/c17-8-2-1-6-5-15-14-12-7(4-10(19)16-14)3-9(18)13(8)11(6)12;;;;;;;;/h1-5,16H;;;;;;;;/q-2;;;;;2*+1;;/rC14H6Li6N2S5/c15-26-19-20(26)22-5-6-1-2-8-13-9(25-17-24(8)18-25)3-7-4-10(23-16-27(19)20)21-14(22)12(7)11(6)13/h1-5,21H
33 atoms
C  -1.20734486 -1.93365878 -0.17160198
N  -1.99711478 -0.8934549 -0.08840299
C  0.19727398 -1.86814779 -0.25605697
C  -1.40698284 0.32261496 -0.08567899
C  0.83197991 -0.60581393 -0.28061097
C  -0.02760399 0.50784594 -0.19397098
H  -1.68844581 -2.90668367 -0.17050698
N  -2.21344275 1.39683184 0.02936499
C  0.48139895 1.8278378 -0.20457298
C  -1.7767248 2.68280169 0.034617
C  -0.40312495 2.89527367 -0.09208399
C  2.25208374 -0.45714895 -0.36915596
C  2.75161069 0.9200709 -0.46603095
C  1.87675679 1.97501878 -0.35904996
C  0.98160189 -3.02737066 -0.30701696
C  2.33845473 -2.90675667 -0.33934696
C  3.01530166 -1.65789581 -0.34547096
H  0.51505394 -4.00460355 -0.30269496
H  2.94783267 -3.79971257 -0.35041896
H  2.27474374 2.97947366 -0.42247795
H  -0.035482 3.91184356 -0.09992499
S  4.4105525 1.41273184 -0.77363191
S  4.75303846 -1.85395479 -0.27787797
S  -2.89207867 3.97080255 0.19183998
H  -3.24357063 1.21099586 0.11918098
Li 5.46056638 0.09805799 0.9077439
Li 5.2720994 -0.37571296 -2.09088077
Li -5.08652042 2.98228366 0.39122295
S  -5.34449439 0.75643992 0.29429597
Li -4.04841154 -1.18856686 -0.0001
Li -6.63010125 -1.15718087 0.27414897
S  -5.37530739 -3.05563165 -0.004891
Li -5.67590236 -5.2407084 -0.21823798
energy: -2683.2826605951532
energyOcCorr: -2683.2960480959
s2: 0.00000000
charge: 0.000000
dipole: -137.143388 145.611265 8.467877 -3.772458 -1.127701 -4.900159 -63.473745 62.445656 -1.028090
quadrupole: 9213.991525 -9290.335224 -76.343699 3615.841223 -3720.401146 -104.559922 129.260776 -254.869545 -125.608769 -166.374213 198.975088 32.600875 -595.316916 591.509672 -3.807244 102.409500 -94.358698 8.050802
