title: ChemShell job
elementType: c
basis: def2-mSVP
elementType: n
elementType: h
elementType: s
elementType: li
method: uhf
method: dft
functional: pbeh-3c
elementType: c n h s li
basis: def2-mSVP def2-mSVP def2-mSVP def2-mSVP def2-mSVP
frequency: -0.00 -0.00 -0.00 -0.00 0.0000 0.0000 17.59 30.40 38.94 48.06 62.65 73.43 80.12 98.09 118.60 132.41 136.08 142.38 153.58 159.55 183.70 189.95 194.25 197.49 206.77 213.16 232.21 240.08 254.32 268.26 274.19 280.87 290.03 303.53 311.08 317.54 329.46 330.63 338.63 344.70 348.18 362.76 368.73 377.24 386.37 392.50 400.99 409.18 417.11 420.75 429.01 430.64 451.49 462.71 465.30 480.54 501.97 516.63 539.85 544.17 560.24 569.13 581.43 585.21 628.29 633.89 665.75 667.69 702.94 713.49 729.21 730.60 786.09 787.41 794.85 817.98 843.59 863.21 886.15 898.56 900.36 918.43 947.62 973.54 1020.61 1033.44 1036.65 1050.91 1100.86 1142.75 1155.08 1165.29 1193.86 1210.82 1262.94 1276.80 1296.62 1328.99 1341.63 1357.88 1382.31 1388.47 1398.88 1419.20 1431.77 1471.05 1490.25 1501.75 1526.71 1548.09 1569.03 1590.73 1605.79 1622.67 1652.55 1667.72 1703.34 1717.38 1732.83 3227.81 3244.56 3273.03 3275.06 3285.77 3286.47 3636.05
irintensity: 0.00000 0.00000 0.00000 0.00000 0 0 4.96097 0.88831 2.23794 1.15484 1.02624 0.65905 0.57260 12.47030 33.92817 22.23031 25.95135 25.49895 5.33677 97.25672 15.84973 10.46178 40.61205 26.35382 15.53826 2.29007 2.49696 23.63063 452.99078 23.16636 16.62829 32.18810 185.16578 209.58881 66.36474 43.03117 44.99241 73.89648 109.80852 75.90472 79.77493 51.59742 3.13156 24.14094 167.64198 54.44237 97.79222 130.26660 337.00111 137.14224 144.44339 317.85558 279.25000 138.41819 159.16969 25.43198 50.58030 20.13304 1.98817 21.73403 12.40410 1.72117 10.40346 9.35994 19.15722 5.12435 36.52732 56.01374 18.86304 5.24715 12.25408 61.54694 34.60642 33.58768 31.85880 28.53117 3.96187 24.84322 12.18050 57.08799 95.30018 59.14285 4.39942 100.10202 57.45531 0.05527 0.81959 0.97593 292.28806 264.49428 126.71389 311.62610 60.75791 241.62212 213.92693 345.39013 7.04886 122.17296 56.01560 42.12777 1120.28344 5.36603 118.50681 5.75949 19.33542 265.81919 134.31408 57.25849 282.17414 453.01004 283.61678 17.10099 72.16482 695.02948 365.39626 94.57936 1015.05550 155.20154 1011.77974 11.51211 75.89350 10.22822 11.04607 14.27399 4.18245 194.76478
energy: -2940.032493254 hartree
zeropoint: 0.23740237933999997 hartree
formula: C19H7Li8N3S5
InChI: InChI=1/C19H7N3S2.8Li.3S/c23-12-4-3-10-15-11(12)7-9-2-1-8-5-6-20-17-14(8)13(9)16(15)18(21-17)22-19(10)24;;;;;;;;;;;/h1-6,22H;;;;;;;;;;;/rC19H7Li8N3S5/c31-18-8-2-4-10-15-12(8)14-13-9(3-1-7-5-6-28-16(11(7)13)29-17(14)30-18)19(15)20-35-23-33-22-34(26(33,35)27(33,34)35)21-32(10,24(19)35)25(34)35/h1-6,30H
42 atoms
C  -2.00190555 -2.67557504 -0.47281031
N  -3.0960071 -1.97024192 -0.39287947
C  -0.68655471 -2.15629925 -0.38990144
C  -2.97554935 -0.6293922 -0.21650206
C  -0.54427954 -0.78736165 -0.21013654
C  -1.70804105 -0.00322521 -0.12046931
N  -4.10637488 0.0777784 -0.13797624
C  -1.61641731 1.39127637 0.05988379
C  -4.00633251 1.38833223 0.03418986
C  -2.81355369 2.09526561 0.13903553
C  0.7574363 -0.21745377 -0.1342206
C  0.80581857 1.21254755 0.0606594
C  -0.30896285 1.97814453 0.1519287
C  0.4366564 -2.99448621 -0.47616988
C  1.73276176 -2.4062464 -0.38382441
C  1.91745218 -0.99180449 -0.24595266
H  -0.22727011 3.04668667 0.30568392
H  -2.82829034 3.16810485 0.27835492
H  -4.94450728 1.92965763 0.09440539
C  2.85293077 -3.30150171 -0.42713842
C  0.23726039 -4.38506523 -0.6513176
N  -2.12194885 -4.031175 -0.64922783
C  -1.10597773 -4.92350825 -0.74644838
C  2.63499935 -4.66655118 -0.60754523
C  1.36137269 -5.19770903 -0.72478034
H  3.48471465 -5.33553096 -0.64240145
H  1.23668704 -6.26391091 -0.86177507
H  -3.06314698 -4.39922478 -0.7113089
S  4.48575307 -2.72484446 -0.20200577
S  7.15769342 -2.04062248 -2.74811807
H  1.77982996 1.68322497 0.16033675
S  4.77932484 0.74904648 -1.8524611
S  8.35148131 1.43593635 -2.46197386
Li 6.57417021 0.24961598 -3.57345297
Li 7.05373055 -0.13716687 -1.18364808
Li 6.42669517 -3.73336558 -1.34828794
Li 9.09016451 -0.71030595 -2.93292363
Li 4.91952024 -1.57013108 -2.33127281
Li 3.95923195 -0.39802847 0.09687137
Li 6.38225953 2.49322647 -1.89682946
Li 2.52357265 0.3333472 -1.98144553
S  -1.47050424 -6.5357899 -0.96360257
energy: -2940.0324932535232
energyOcCorr: -2940.0342989404
s2: -0.00000000
charge: 0.000000
dipole: 781.648474 -776.946876 4.701598 -694.548235 697.273874 2.725640 -413.680031 413.084750 -0.595281
quadrupole: 15219.573738 -15395.594861 -176.021123 7526.559446 -7704.543233 -177.983787 1518.399925 -1673.934717 -155.534792 -852.725167 798.655219 -54.069948 -3790.530562 3793.403406 2.872843 1051.673906 -1049.419315 2.254591
temp: 298.15 k
press: 1.0 bar
thermalcorrgfe: 0.176134054712 hartree
thermalcorrener: 0.26880591885 hartree
entropy: 0.82441 kJ.mol-1.K-1
thermalcorrenthalpy: 0.269750500754 hartree
