title: ChemShell job
elementType: c
basis: def2-TZVPD
elementType: n
elementType: h
elementType: s
elementType: li
method: uhf
method: dft
functional: cam-b3lyp
elementType: c n h s li
basis: def2-TZVPD def2-TZVPD def2-TZVPD def2-TZVPD def2-TZVPD
energy: -1704.000087624 hartree
formula: C19H7Li2N3S2
InChI: InChI=1/C19H7N3S2.2Li/c23-16-9-2-1-3-11-13(9)15-14-10(16)5-4-8-6-7-20-17(12(8)14)21-18(15)22-19(11)24;;/h1,3-7,22H;;/rC19H7Li2N3S2/c25-18-9-3-5-19-14-12(9)13-11-8(15(14)26(20-19)21-19)2-1-7-4-6-22-16(10(7)11)23-17(13)24-18/h1-6,24H
33 atoms
C  -1.64851381 -2.16484976 -0.57813094
N  -2.73832869 -1.46296984 -0.42360995
C  -0.33592996 -1.64749081 -0.59840093
C  -2.60296071 -0.12259399 -0.26718697
C  -0.16959798 -0.27469497 -0.44116295
C  -1.32996885 0.50692994 -0.27095897
N  -3.72658658 0.58335193 -0.10742999
C  -1.23550586 1.90281578 -0.10373699
C  -3.61977759 1.89524378 0.04926
C  -2.42592173 2.6052407 0.06077599
C  1.12188187 0.31185497 -0.45071795
C  1.18295187 1.7348328 -0.27920197
C  0.07122999 2.49282272 -0.11463199
C  0.77300191 -2.48932772 -0.77032791
C  2.08458176 -1.94285478 -0.78745791
C  2.25061874 -0.50956294 -0.62253993
H  0.15930398 3.56434659 0.012171
H  -2.43234372 3.67856958 0.19566798
H  -4.55343248 2.43288072 0.17705598
C  3.22400563 -2.77640269 -0.96223089
C  0.57203893 -3.88053256 -0.9244059
N  -1.7804438 -3.5241976 -0.73404892
C  -0.77991491 -4.4193105 -0.9025449
C  2.96360366 -4.13948653 -1.10958987
C  1.68470581 -4.69226547 -1.09296988
H  3.79313057 -4.82636845 -1.24628986
H  1.54432282 -5.75946635 -1.21186286
S  -1.15758887 -6.03327532 -1.06893688
H  -2.72463269 -3.89004156 -0.71863292
H  2.15507076 2.20905775 -0.28253497
S  3.84912556 0.18606798 -0.63792493
Li 4.48237749 -1.55298082 -2.21931575
Li 4.66184847 -1.87684979 0.36982296
energy: -1704.0000876235101
energyOcCorr: -1704.0034583927
s2: -0.00000000
charge: -0.000000
dipole: 40.448363 -31.903674 8.544690 -459.053080 460.574559 1.521479 -199.905287 199.520969 -0.384318
quadrupole: 3630.396030 -3704.832828 -74.436798 5535.876814 -5683.047239 -147.170424 344.837913 -452.942339 -108.104427 -583.575571 540.879959 -42.695611 -333.289742 319.023756 -14.265986 1066.682818 -1069.672100 -2.989282
